sbuild (Debian sbuild) 0.86.3~bpo12+1 (03 November 2024) on debusine-worker-arm64-demeter-08.freexian.com
+==============================================================================+
| armnn 23.08-4.1 (arm64) Fri, 15 Nov 2024 19:11:24 +0000 |
+==============================================================================+
Package: armnn
Version: 23.08-4.1
Source Version: 23.08-4.1
Distribution: sid
Machine Architecture: arm64
Host Architecture: arm64
Build Architecture: arm64
Build Type: binary
I: No tarballs found in /var/lib/debusine/worker/.cache/sbuild
Unpacking /var/lib/debusine/worker/system-images/957781/system.tar.xz to /tmp/tmp.sbuild.FVzJTujJUo...
I: NOTICE: Log filtering will replace 'sbuild-unshare-dummy-location' with '<<CHROOT>>'
+------------------------------------------------------------------------------+
| Chroot Setup Commands |
+------------------------------------------------------------------------------+
rm -f /etc/resolv.conf
----------------------
I: Finished running 'rm -f /etc/resolv.conf'.
Finished processing commands.
--------------------------------------------------------------------------------
Copying /tmp/debusine-fetch-exec-upload-vfdej8m0/dpkg-dbgsym_1.22.12~1.gbp82cafd_arm64.deb to /<<CHROOT>>...
Copying /tmp/debusine-fetch-exec-upload-vfdej8m0/dpkg_1.22.12~1.gbp82cafd_arm64.deb to /<<CHROOT>>...
Copying /tmp/debusine-fetch-exec-upload-vfdej8m0/dselect-dbgsym_1.22.12~1.gbp82cafd_arm64.deb to /<<CHROOT>>...
Copying /tmp/debusine-fetch-exec-upload-vfdej8m0/dselect_1.22.12~1.gbp82cafd_arm64.deb to /<<CHROOT>>...
Copying /tmp/debusine-fetch-exec-upload-vfdej8m0/libdpkg-dev_1.22.12~1.gbp82cafd_arm64.deb to /<<CHROOT>>...
Copying /tmp/debusine-fetch-exec-upload-vfdej8m0/dpkg-dev_1.22.12~1.gbp82cafd_all.deb to /<<CHROOT>>...
Copying /tmp/debusine-fetch-exec-upload-vfdej8m0/libdpkg-perl_1.22.12~1.gbp82cafd_all.deb to /<<CHROOT>>...
I: NOTICE: Log filtering will replace 'build/armnn-4g74lm/resolver-4XSFLq' with '<<RESOLVERDIR>>'
+------------------------------------------------------------------------------+
| Update chroot |
+------------------------------------------------------------------------------+
Get:1 file:/build/armnn-4g74lm/resolver-dWet20/apt_archive ./ InRelease
Ign:1 file:/build/armnn-4g74lm/resolver-dWet20/apt_archive ./ InRelease
Get:2 file:/build/armnn-4g74lm/resolver-dWet20/apt_archive ./ Release [606 B]
Get:2 file:/build/armnn-4g74lm/resolver-dWet20/apt_archive ./ Release [606 B]
Get:3 http://deb.debian.org/debian sid InRelease [202 kB]
Get:4 file:/build/armnn-4g74lm/resolver-dWet20/apt_archive ./ Release.gpg
Ign:4 file:/build/armnn-4g74lm/resolver-dWet20/apt_archive ./ Release.gpg
Get:5 file:/build/armnn-4g74lm/resolver-dWet20/apt_archive ./ Packages [9246 B]
Get:6 http://deb.debian.org/debian sid/main arm64 Packages [9951 kB]
Get:7 http://deb.debian.org/debian sid/main arm64 Components [4911 kB]
Fetched 15.1 MB in 2s (6363 kB/s)
Reading package lists...
Reading package lists...
Building dependency tree...
Reading state information...
Calculating upgrade...
The following packages will be upgraded:
apt bsdextrautils bsdutils dpkg dpkg-dev libapt-pkg6.0t64 libaudit-common
libaudit1 libblkid1 libbrotli1 libcap-ng0 libdpkg-perl libglib2.0-0t64
libmount1 libpcre2-8-0 libseccomp2 libselinux1 libsemanage2 libsmartcols1
libuuid1 libxml2 login mount util-linux
24 upgraded, 0 newly installed, 0 to remove and 0 not upgraded.
Need to get 7198 kB/10.7 MB of archives.
After this operation, 602 kB disk space will be freed.
Get:1 http://deb.debian.org/debian sid/main arm64 bsdutils arm64 1:2.40.2-11 [104 kB]
Get:2 file:/build/armnn-4g74lm/resolver-dWet20/apt_archive ./ dpkg 1.22.12~1.gbp82cafd [1513 kB]
Get:3 file:/build/armnn-4g74lm/resolver-dWet20/apt_archive ./ dpkg-dev 1.22.12~1.gbp82cafd [1337 kB]
Get:4 http://deb.debian.org/debian sid/main arm64 libapt-pkg6.0t64 arm64 2.9.11 [921 kB]
Get:5 file:/build/armnn-4g74lm/resolver-dWet20/apt_archive ./ libdpkg-perl 1.22.12~1.gbp82cafd [647 kB]
Get:6 http://deb.debian.org/debian sid/main arm64 bsdextrautils arm64 2.40.2-11 [91.2 kB]
Get:7 http://deb.debian.org/debian sid/main arm64 libblkid1 arm64 2.40.2-11 [162 kB]
Get:8 http://deb.debian.org/debian sid/main arm64 libmount1 arm64 2.40.2-11 [190 kB]
Get:9 http://deb.debian.org/debian sid/main arm64 libsmartcols1 arm64 2.40.2-11 [135 kB]
Get:10 http://deb.debian.org/debian sid/main arm64 mount arm64 2.40.2-11 [153 kB]
Get:11 http://deb.debian.org/debian sid/main arm64 libuuid1 arm64 2.40.2-11 [35.7 kB]
Get:12 http://deb.debian.org/debian sid/main arm64 util-linux arm64 2.40.2-11 [1170 kB]
Get:13 http://deb.debian.org/debian sid/main arm64 libpcre2-8-0 arm64 10.44-2 [242 kB]
Get:14 http://deb.debian.org/debian sid/main arm64 libselinux1 arm64 3.7-3+b1 [72.1 kB]
Get:15 http://deb.debian.org/debian sid/main arm64 libseccomp2 arm64 2.5.5-1+b3 [46.8 kB]
Get:16 http://deb.debian.org/debian sid/main arm64 apt arm64 2.9.11 [1287 kB]
Get:17 http://deb.debian.org/debian sid/main arm64 libaudit-common all 1:4.0.2-2 [12.7 kB]
Get:18 http://deb.debian.org/debian sid/main arm64 libcap-ng0 arm64 0.8.5-3+b1 [17.0 kB]
Get:19 http://deb.debian.org/debian sid/main arm64 libaudit1 arm64 1:4.0.2-2 [54.2 kB]
Get:20 http://deb.debian.org/debian sid/main arm64 login arm64 1:4.16.0-2+really2.40.2-11 [80.0 kB]
Get:21 http://deb.debian.org/debian sid/main arm64 libbrotli1 arm64 1.1.0-2+b6 [297 kB]
Get:22 http://deb.debian.org/debian sid/main arm64 libglib2.0-0t64 arm64 2.82.2-3 [1411 kB]
Get:23 http://deb.debian.org/debian sid/main arm64 libsemanage2 arm64 3.7-2+b1 [84.5 kB]
Get:24 http://deb.debian.org/debian sid/main arm64 libxml2 arm64 2.12.7+dfsg+really2.9.14-0.2+b1 [630 kB]
debconf: delaying package configuration, since apt-utils is not installed
Fetched 7198 kB in 0s (53.7 MB/s)
(Reading database ...
(Reading database ... 5%
(Reading database ... 10%
(Reading database ... 15%
(Reading database ... 20%
(Reading database ... 25%
(Reading database ... 30%
(Reading database ... 35%
(Reading database ... 40%
(Reading database ... 45%
(Reading database ... 50%
(Reading database ... 55%
(Reading database ... 60%
(Reading database ... 65%
(Reading database ... 70%
(Reading database ... 75%
(Reading database ... 80%
(Reading database ... 85%
(Reading database ... 90%
(Reading database ... 95%
(Reading database ... 100%
(Reading database ... 17129 files and directories currently installed.)
Preparing to unpack .../bsdutils_1%3a2.40.2-11_arm64.deb ...
Unpacking bsdutils (1:2.40.2-11) over (1:2.40.2-10) ...
Setting up bsdutils (1:2.40.2-11) ...
(Reading database ...
(Reading database ... 5%
(Reading database ... 10%
(Reading database ... 15%
(Reading database ... 20%
(Reading database ... 25%
(Reading database ... 30%
(Reading database ... 35%
(Reading database ... 40%
(Reading database ... 45%
(Reading database ... 50%
(Reading database ... 55%
(Reading database ... 60%
(Reading database ... 65%
(Reading database ... 70%
(Reading database ... 75%
(Reading database ... 80%
(Reading database ... 85%
(Reading database ... 90%
(Reading database ... 95%
(Reading database ... 100%
(Reading database ... 17129 files and directories currently installed.)
Preparing to unpack .../libapt-pkg6.0t64_2.9.11_arm64.deb ...
Unpacking libapt-pkg6.0t64:arm64 (2.9.11) over (2.9.10) ...
Setting up libapt-pkg6.0t64:arm64 (2.9.11) ...
(Reading database ...
(Reading database ... 5%
(Reading database ... 10%
(Reading database ... 15%
(Reading database ... 20%
(Reading database ... 25%
(Reading database ... 30%
(Reading database ... 35%
(Reading database ... 40%
(Reading database ... 45%
(Reading database ... 50%
(Reading database ... 55%
(Reading database ... 60%
(Reading database ... 65%
(Reading database ... 70%
(Reading database ... 75%
(Reading database ... 80%
(Reading database ... 85%
(Reading database ... 90%
(Reading database ... 95%
(Reading database ... 100%
(Reading database ... 17129 files and directories currently installed.)
Preparing to unpack .../dpkg_1.22.12~1.gbp82cafd_arm64.deb ...
Unpacking dpkg (1.22.12~1.gbp82cafd) over (1.22.11) ...
Setting up dpkg (1.22.12~1.gbp82cafd) ...
(Reading database ...
(Reading database ... 5%
(Reading database ... 10%
(Reading database ... 15%
(Reading database ... 20%
(Reading database ... 25%
(Reading database ... 30%
(Reading database ... 35%
(Reading database ... 40%
(Reading database ... 45%
(Reading database ... 50%
(Reading database ... 55%
(Reading database ... 60%
(Reading database ... 65%
(Reading database ... 70%
(Reading database ... 75%
(Reading database ... 80%
(Reading database ... 85%
(Reading database ... 90%
(Reading database ... 95%
(Reading database ... 100%
(Reading database ... 17128 files and directories currently installed.)
Preparing to unpack .../bsdextrautils_2.40.2-11_arm64.deb ...
Unpacking bsdextrautils (2.40.2-11) over (2.40.2-10) ...
Preparing to unpack .../libblkid1_2.40.2-11_arm64.deb ...
Unpacking libblkid1:arm64 (2.40.2-11) over (2.40.2-10) ...
Setting up libblkid1:arm64 (2.40.2-11) ...
(Reading database ...
(Reading database ... 5%
(Reading database ... 10%
(Reading database ... 15%
(Reading database ... 20%
(Reading database ... 25%
(Reading database ... 30%
(Reading database ... 35%
(Reading database ... 40%
(Reading database ... 45%
(Reading database ... 50%
(Reading database ... 55%
(Reading database ... 60%
(Reading database ... 65%
(Reading database ... 70%
(Reading database ... 75%
(Reading database ... 80%
(Reading database ... 85%
(Reading database ... 90%
(Reading database ... 95%
(Reading database ... 100%
(Reading database ... 17124 files and directories currently installed.)
Preparing to unpack .../libmount1_2.40.2-11_arm64.deb ...
Unpacking libmount1:arm64 (2.40.2-11) over (2.40.2-10) ...
Setting up libmount1:arm64 (2.40.2-11) ...
(Reading database ...
(Reading database ... 5%
(Reading database ... 10%
(Reading database ... 15%
(Reading database ... 20%
(Reading database ... 25%
(Reading database ... 30%
(Reading database ... 35%
(Reading database ... 40%
(Reading database ... 45%
(Reading database ... 50%
(Reading database ... 55%
(Reading database ... 60%
(Reading database ... 65%
(Reading database ... 70%
(Reading database ... 75%
(Reading database ... 80%
(Reading database ... 85%
(Reading database ... 90%
(Reading database ... 95%
(Reading database ... 100%
(Reading database ... 17124 files and directories currently installed.)
Preparing to unpack .../libsmartcols1_2.40.2-11_arm64.deb ...
Unpacking libsmartcols1:arm64 (2.40.2-11) over (2.40.2-10) ...
Setting up libsmartcols1:arm64 (2.40.2-11) ...
(Reading database ...
(Reading database ... 5%
(Reading database ... 10%
(Reading database ... 15%
(Reading database ... 20%
(Reading database ... 25%
(Reading database ... 30%
(Reading database ... 35%
(Reading database ... 40%
(Reading database ... 45%
(Reading database ... 50%
(Reading database ... 55%
(Reading database ... 60%
(Reading database ... 65%
(Reading database ... 70%
(Reading database ... 75%
(Reading database ... 80%
(Reading database ... 85%
(Reading database ... 90%
(Reading database ... 95%
(Reading database ... 100%
(Reading database ... 17124 files and directories currently installed.)
Preparing to unpack .../mount_2.40.2-11_arm64.deb ...
Unpacking mount (2.40.2-11) over (2.40.2-10) ...
Preparing to unpack .../libuuid1_2.40.2-11_arm64.deb ...
Unpacking libuuid1:arm64 (2.40.2-11) over (2.40.2-10) ...
Setting up libuuid1:arm64 (2.40.2-11) ...
(Reading database ...
(Reading database ... 5%
(Reading database ... 10%
(Reading database ... 15%
(Reading database ... 20%
(Reading database ... 25%
(Reading database ... 30%
(Reading database ... 35%
(Reading database ... 40%
(Reading database ... 45%
(Reading database ... 50%
(Reading database ... 55%
(Reading database ... 60%
(Reading database ... 65%
(Reading database ... 70%
(Reading database ... 75%
(Reading database ... 80%
(Reading database ... 85%
(Reading database ... 90%
(Reading database ... 95%
(Reading database ... 100%
(Reading database ... 17124 files and directories currently installed.)
Preparing to unpack .../util-linux_2.40.2-11_arm64.deb ...
Unpacking util-linux (2.40.2-11) over (2.40.2-10) ...
Setting up util-linux (2.40.2-11) ...
(Reading database ...
(Reading database ... 5%
(Reading database ... 10%
(Reading database ... 15%
(Reading database ... 20%
(Reading database ... 25%
(Reading database ... 30%
(Reading database ... 35%
(Reading database ... 40%
(Reading database ... 45%
(Reading database ... 50%
(Reading database ... 55%
(Reading database ... 60%
(Reading database ... 65%
(Reading database ... 70%
(Reading database ... 75%
(Reading database ... 80%
(Reading database ... 85%
(Reading database ... 90%
(Reading database ... 95%
(Reading database ... 100%
(Reading database ... 17121 files and directories currently installed.)
Preparing to unpack .../libpcre2-8-0_10.44-2_arm64.deb ...
Unpacking libpcre2-8-0:arm64 (10.44-2) over (10.42-4+b2) ...
Setting up libpcre2-8-0:arm64 (10.44-2) ...
(Reading database ...
(Reading database ... 5%
(Reading database ... 10%
(Reading database ... 15%
(Reading database ... 20%
(Reading database ... 25%
(Reading database ... 30%
(Reading database ... 35%
(Reading database ... 40%
(Reading database ... 45%
(Reading database ... 50%
(Reading database ... 55%
(Reading database ... 60%
(Reading database ... 65%
(Reading database ... 70%
(Reading database ... 75%
(Reading database ... 80%
(Reading database ... 85%
(Reading database ... 90%
(Reading database ... 95%
(Reading database ... 100%
(Reading database ... 17120 files and directories currently installed.)
Preparing to unpack .../libselinux1_3.7-3+b1_arm64.deb ...
Unpacking libselinux1:arm64 (3.7-3+b1) over (3.7-3) ...
Setting up libselinux1:arm64 (3.7-3+b1) ...
(Reading database ...
(Reading database ... 5%
(Reading database ... 10%
(Reading database ... 15%
(Reading database ... 20%
(Reading database ... 25%
(Reading database ... 30%
(Reading database ... 35%
(Reading database ... 40%
(Reading database ... 45%
(Reading database ... 50%
(Reading database ... 55%
(Reading database ... 60%
(Reading database ... 65%
(Reading database ... 70%
(Reading database ... 75%
(Reading database ... 80%
(Reading database ... 85%
(Reading database ... 90%
(Reading database ... 95%
(Reading database ... 100%
(Reading database ... 17121 files and directories currently installed.)
Preparing to unpack .../libseccomp2_2.5.5-1+b3_arm64.deb ...
Unpacking libseccomp2:arm64 (2.5.5-1+b3) over (2.5.5-1+b2) ...
Setting up libseccomp2:arm64 (2.5.5-1+b3) ...
(Reading database ...
(Reading database ... 5%
(Reading database ... 10%
(Reading database ... 15%
(Reading database ... 20%
(Reading database ... 25%
(Reading database ... 30%
(Reading database ... 35%
(Reading database ... 40%
(Reading database ... 45%
(Reading database ... 50%
(Reading database ... 55%
(Reading database ... 60%
(Reading database ... 65%
(Reading database ... 70%
(Reading database ... 75%
(Reading database ... 80%
(Reading database ... 85%
(Reading database ... 90%
(Reading database ... 95%
(Reading database ... 100%
(Reading database ... 17121 files and directories currently installed.)
Preparing to unpack .../archives/apt_2.9.11_arm64.deb ...
Unpacking apt (2.9.11) over (2.9.10) ...
Setting up apt (2.9.11) ...
(Reading database ...
(Reading database ... 5%
(Reading database ... 10%
(Reading database ... 15%
(Reading database ... 20%
(Reading database ... 25%
(Reading database ... 30%
(Reading database ... 35%
(Reading database ... 40%
(Reading database ... 45%
(Reading database ... 50%
(Reading database ... 55%
(Reading database ... 60%
(Reading database ... 65%
(Reading database ... 70%
(Reading database ... 75%
(Reading database ... 80%
(Reading database ... 85%
(Reading database ... 90%
(Reading database ... 95%
(Reading database ... 100%
(Reading database ... 17118 files and directories currently installed.)
Preparing to unpack .../libaudit-common_1%3a4.0.2-2_all.deb ...
Unpacking libaudit-common (1:4.0.2-2) over (1:4.0.1-3) ...
Setting up libaudit-common (1:4.0.2-2) ...
(Reading database ...
(Reading database ... 5%
(Reading database ... 10%
(Reading database ... 15%
(Reading database ... 20%
(Reading database ... 25%
(Reading database ... 30%
(Reading database ... 35%
(Reading database ... 40%
(Reading database ... 45%
(Reading database ... 50%
(Reading database ... 55%
(Reading database ... 60%
(Reading database ... 65%
(Reading database ... 70%
(Reading database ... 75%
(Reading database ... 80%
(Reading database ... 85%
(Reading database ... 90%
(Reading database ... 95%
(Reading database ... 100%
(Reading database ... 17118 files and directories currently installed.)
Preparing to unpack .../libcap-ng0_0.8.5-3+b1_arm64.deb ...
Unpacking libcap-ng0:arm64 (0.8.5-3+b1) over (0.8.5-3) ...
Setting up libcap-ng0:arm64 (0.8.5-3+b1) ...
(Reading database ...
(Reading database ... 5%
(Reading database ... 10%
(Reading database ... 15%
(Reading database ... 20%
(Reading database ... 25%
(Reading database ... 30%
(Reading database ... 35%
(Reading database ... 40%
(Reading database ... 45%
(Reading database ... 50%
(Reading database ... 55%
(Reading database ... 60%
(Reading database ... 65%
(Reading database ... 70%
(Reading database ... 75%
(Reading database ... 80%
(Reading database ... 85%
(Reading database ... 90%
(Reading database ... 95%
(Reading database ... 100%
(Reading database ... 17119 files and directories currently installed.)
Preparing to unpack .../libaudit1_1%3a4.0.2-2_arm64.deb ...
Unpacking libaudit1:arm64 (1:4.0.2-2) over (1:4.0.1-3) ...
Setting up libaudit1:arm64 (1:4.0.2-2) ...
(Reading database ...
(Reading database ... 5%
(Reading database ... 10%
(Reading database ... 15%
(Reading database ... 20%
(Reading database ... 25%
(Reading database ... 30%
(Reading database ... 35%
(Reading database ... 40%
(Reading database ... 45%
(Reading database ... 50%
(Reading database ... 55%
(Reading database ... 60%
(Reading database ... 65%
(Reading database ... 70%
(Reading database ... 75%
(Reading database ... 80%
(Reading database ... 85%
(Reading database ... 90%
(Reading database ... 95%
(Reading database ... 100%
(Reading database ... 17119 files and directories currently installed.)
Preparing to unpack .../0-login_1%3a4.16.0-2+really2.40.2-11_arm64.deb ...
Unpacking login (1:4.16.0-2+really2.40.2-11) over (1:4.16.0-2+really2.40.2-10) ...
Preparing to unpack .../1-dpkg-dev_1.22.12~1.gbp82cafd_all.deb ...
Unpacking dpkg-dev (1.22.12~1.gbp82cafd) over (1.22.11) ...
Preparing to unpack .../2-libdpkg-perl_1.22.12~1.gbp82cafd_all.deb ...
Unpacking libdpkg-perl (1.22.12~1.gbp82cafd) over (1.22.11) ...
Preparing to unpack .../3-libbrotli1_1.1.0-2+b6_arm64.deb ...
Unpacking libbrotli1:arm64 (1.1.0-2+b6) over (1.1.0-2+b5) ...
Preparing to unpack .../4-libglib2.0-0t64_2.82.2-3_arm64.deb ...
Unpacking libglib2.0-0t64:arm64 (2.82.2-3) over (2.82.2-2) ...
Preparing to unpack .../5-libsemanage2_3.7-2+b1_arm64.deb ...
Unpacking libsemanage2:arm64 (3.7-2+b1) over (3.7-2) ...
Preparing to unpack .../6-libxml2_2.12.7+dfsg+really2.9.14-0.2+b1_arm64.deb ...
Unpacking libxml2:arm64 (2.12.7+dfsg+really2.9.14-0.2+b1) over (2.12.7+dfsg+really2.9.14-0.1) ...
Setting up bsdextrautils (2.40.2-11) ...
Setting up libbrotli1:arm64 (1.1.0-2+b6) ...
Setting up libglib2.0-0t64:arm64 (2.82.2-3) ...
No schema files found: doing nothing.
Setting up libdpkg-perl (1.22.12~1.gbp82cafd) ...
Setting up mount (2.40.2-11) ...
Setting up libsemanage2:arm64 (3.7-2+b1) ...
Setting up libxml2:arm64 (2.12.7+dfsg+really2.9.14-0.2+b1) ...
Setting up login (1:4.16.0-2+really2.40.2-11) ...
Setting up dpkg-dev (1.22.12~1.gbp82cafd) ...
Processing triggers for man-db (2.13.0-1) ...
Processing triggers for libc-bin (2.40-3) ...
+------------------------------------------------------------------------------+
| Fetch source files |
+------------------------------------------------------------------------------+
Local sources
-------------
/tmp/debusine-fetch-exec-upload-vfdej8m0/armnn_23.08-4.1.dsc exists in /tmp/debusine-fetch-exec-upload-vfdej8m0; copying to chroot
I: NOTICE: Log filtering will replace 'build/armnn-4g74lm/armnn-23.08' with '<<PKGBUILDDIR>>'
I: NOTICE: Log filtering will replace 'build/armnn-4g74lm' with '<<BUILDDIR>>'
+------------------------------------------------------------------------------+
| Install package build dependencies |
+------------------------------------------------------------------------------+
Setup apt archive
-----------------
Merged Build-Depends: dpkg-dev (>= 1.22.5), libboost-test-dev (>= 1.64), libboost-system-dev (>= 1.64), libboost-filesystem-dev (>= 1.64), libboost-log-dev (>= 1.64), libboost-program-options-dev (>= 1.64), cmake, debhelper-compat (= 12), valgrind, libflatbuffers-dev, libarm-compute-dev, swig (>= 4.0.1-5), dh-python, python3-setuptools, libpython3-dev, python3-dev:any, python3-numpy, xxd, flatbuffers-compiler, chrpath, build-essential, fakeroot
Filtered Build-Depends: dpkg-dev (>= 1.22.5), libboost-test-dev (>= 1.64), libboost-system-dev (>= 1.64), libboost-filesystem-dev (>= 1.64), libboost-log-dev (>= 1.64), libboost-program-options-dev (>= 1.64), cmake, debhelper-compat (= 12), valgrind, libflatbuffers-dev, libarm-compute-dev, swig (>= 4.0.1-5), dh-python, python3-setuptools, libpython3-dev, python3-dev:any, python3-numpy, xxd, flatbuffers-compiler, chrpath, build-essential, fakeroot
dpkg-deb: warning: root directory has unusual owner or group 998:999.
Hint: either pass --root-owner-group, see dpkg-build-api(7) or add an explicit 'Rules-Requires-Root: no' in debian/control.
dpkg-deb: warning: ignoring 1 warning about the control file(s)
dpkg-deb: building package 'sbuild-build-depends-main-dummy' in '/<<RESOLVERDIR>>/apt_archive/sbuild-build-depends-main-dummy.deb'.
Ign:1 copy:/<<RESOLVERDIR>>/apt_archive ./ InRelease
Get:2 copy:/<<RESOLVERDIR>>/apt_archive ./ Release [615 B]
Ign:3 copy:/<<RESOLVERDIR>>/apt_archive ./ Release.gpg
Get:4 copy:/<<RESOLVERDIR>>/apt_archive ./ Sources [1020 B]
Get:5 copy:/<<RESOLVERDIR>>/apt_archive ./ Packages [1026 B]
Fetched 2661 B in 0s (233 kB/s)
Reading package lists...
Get:1 file:/<<BUILDDIR>>/resolver-dWet20/apt_archive ./ InRelease
Ign:1 file:/<<BUILDDIR>>/resolver-dWet20/apt_archive ./ InRelease
Get:2 file:/<<BUILDDIR>>/resolver-dWet20/apt_archive ./ Release [606 B]
Get:2 file:/<<BUILDDIR>>/resolver-dWet20/apt_archive ./ Release [606 B]
Get:3 file:/<<BUILDDIR>>/resolver-dWet20/apt_archive ./ Release.gpg
Ign:3 file:/<<BUILDDIR>>/resolver-dWet20/apt_archive ./ Release.gpg
Reading package lists...
Reading package lists...
Install main build dependencies (apt-based resolver)
----------------------------------------------------
Installing build dependencies
Reading package lists...
Building dependency tree...
Reading state information...
The following additional packages will be installed:
autoconf automake autopoint autotools-dev build-essential chrpath cmake
cmake-data cpp cpp-14 cpp-14-aarch64-linux-gnu cpp-aarch64-linux-gnu
debhelper dh-autoreconf dh-python dh-strip-nondeterminism dwz fakeroot
flatbuffers-compiler flatbuffers-compiler-dev g++ g++-14
g++-14-aarch64-linux-gnu g++-aarch64-linux-gnu gcc gcc-14
gcc-14-aarch64-linux-gnu gcc-aarch64-linux-gnu icu-devtools libarchive13t64
libarm-compute-dev libarm-compute32t64 libasan8 libblas3
libboost-atomic1.83-dev libboost-atomic1.83.0 libboost-chrono1.83-dev
libboost-chrono1.83.0t64 libboost-date-time1.83-dev libboost-date-time1.83.0
libboost-filesystem-dev libboost-filesystem1.83-dev
libboost-filesystem1.83.0 libboost-log-dev libboost-log1.83-dev
libboost-log1.83.0 libboost-program-options-dev
libboost-program-options1.83-dev libboost-program-options1.83.0
libboost-regex1.83-dev libboost-regex1.83.0 libboost-serialization1.83-dev
libboost-serialization1.83.0 libboost-system-dev libboost-system1.83-dev
libboost-system1.83.0 libboost-test-dev libboost-test1.83-dev
libboost-test1.83.0 libboost-thread1.83-dev libboost-thread1.83.0
libboost1.83-dev libc-dev-bin libc6-dbg libc6-dev libcc1-0 libcrypt-dev
libcurl4t64 libdebhelper-perl libelf1t64 libexpat1 libexpat1-dev libfakeroot
libfile-stripnondeterminism-perl libflatbuffers-dev libflatbuffers23.5.26
libgcc-14-dev libgfortran5 libhwasan0 libicu-dev libisl23 libitm1
libjs-jquery libjs-sphinxdoc libjs-underscore libjsoncpp26 liblapack3
liblsan0 libmpc3 libmpfr6 libncursesw6 libnsl2 libproc2-0 libpython3-dev
libpython3-stdlib libpython3.12-dev libpython3.12-minimal
libpython3.12-stdlib libpython3.12t64 librhash1 libstdc++-14-dev
libtirpc-common libtirpc3t64 libtool libtsan2 libubsan1 libuv1t64
linux-libc-dev m4 media-types po-debconf procps python3 python3-autocommand
python3-dev python3-inflect python3-jaraco.context python3-jaraco.functools
python3-jaraco.text python3-minimal python3-more-itertools python3-numpy
python3-pkg-resources python3-setuptools python3-typeguard
python3-typing-extensions python3-zipp python3.12 python3.12-dev
python3.12-minimal rpcsvc-proto swig valgrind xxd zlib1g-dev
Suggested packages:
autoconf-archive gnu-standards autoconf-doc cmake-doc cmake-format
elpa-cmake-mode ninja-build cpp-doc gcc-14-locales cpp-14-doc dh-make flit
python3-build python3-installer python3-wheel gcc-14-doc gcc-multilib
manpages-dev flex bison gdb gcc-doc gdb-aarch64-linux-gnu lrzip
libarm-compute-doc libboost1.83-doc libboost-container1.83-dev
libboost-context1.83-dev libboost-contract1.83-dev
libboost-coroutine1.83-dev libboost-exception1.83-dev libboost-fiber1.83-dev
libboost-graph-parallel1.83-dev libboost-graph1.83-dev
libboost-iostreams1.83-dev libboost-json1.83-dev libboost-locale1.83-dev
libboost-math1.83-dev libboost-mpi-python1.83-dev libboost-mpi1.83-dev
libboost-nowide1.83-dev libboost-numpy1.83-dev libboost-python1.83-dev
libboost-random1.83-dev libboost-stacktrace1.83-dev libboost-timer1.83-dev
libboost-type-erasure1.83-dev libboost-url1.83-dev libboost-wave1.83-dev
libboost1.83-tools-dev libmpfrc++-dev libntl-dev libc-devtools glibc-doc
icu-doc libstdc++-14-doc libtool-doc gfortran | fortran95-compiler gcj-jdk
m4-doc libmail-box-perl python3-doc python3-tk python3-venv gfortran
python-numpy-doc python3-pytest python-setuptools-doc python3.12-venv
python3.12-doc binfmt-support swig-doc swig-examples valgrind-mpi
kcachegrind
Recommended packages:
manpages manpages-dev libarchive-cpio-perl javascript-common libgpm2
libltdl-dev libmail-sendmail-perl psmisc linux-sysctl-defaults valgrind-dbg
gdb
The following NEW packages will be installed:
autoconf automake autopoint autotools-dev build-essential chrpath cmake
cmake-data cpp cpp-14 cpp-14-aarch64-linux-gnu cpp-aarch64-linux-gnu
debhelper dh-autoreconf dh-python dh-strip-nondeterminism dwz fakeroot
flatbuffers-compiler flatbuffers-compiler-dev g++ g++-14
g++-14-aarch64-linux-gnu g++-aarch64-linux-gnu gcc gcc-14
gcc-14-aarch64-linux-gnu gcc-aarch64-linux-gnu icu-devtools libarchive13t64
libarm-compute-dev libarm-compute32t64 libasan8 libblas3
libboost-atomic1.83-dev libboost-atomic1.83.0 libboost-chrono1.83-dev
libboost-chrono1.83.0t64 libboost-date-time1.83-dev libboost-date-time1.83.0
libboost-filesystem-dev libboost-filesystem1.83-dev
libboost-filesystem1.83.0 libboost-log-dev libboost-log1.83-dev
libboost-log1.83.0 libboost-program-options-dev
libboost-program-options1.83-dev libboost-program-options1.83.0
libboost-regex1.83-dev libboost-regex1.83.0 libboost-serialization1.83-dev
libboost-serialization1.83.0 libboost-system-dev libboost-system1.83-dev
libboost-system1.83.0 libboost-test-dev libboost-test1.83-dev
libboost-test1.83.0 libboost-thread1.83-dev libboost-thread1.83.0
libboost1.83-dev libc-dev-bin libc6-dbg libc6-dev libcc1-0 libcrypt-dev
libcurl4t64 libdebhelper-perl libelf1t64 libexpat1 libexpat1-dev libfakeroot
libfile-stripnondeterminism-perl libflatbuffers-dev libflatbuffers23.5.26
libgcc-14-dev libgfortran5 libhwasan0 libicu-dev libisl23 libitm1
libjs-jquery libjs-sphinxdoc libjs-underscore libjsoncpp26 liblapack3
liblsan0 libmpc3 libmpfr6 libncursesw6 libnsl2 libproc2-0 libpython3-dev
libpython3-stdlib libpython3.12-dev libpython3.12-minimal
libpython3.12-stdlib libpython3.12t64 librhash1 libstdc++-14-dev
libtirpc-common libtirpc3t64 libtool libtsan2 libubsan1 libuv1t64
linux-libc-dev m4 media-types po-debconf procps python3 python3-autocommand
python3-dev python3-inflect python3-jaraco.context python3-jaraco.functools
python3-jaraco.text python3-minimal python3-more-itertools python3-numpy
python3-pkg-resources python3-setuptools python3-typeguard
python3-typing-extensions python3-zipp python3.12 python3.12-dev
python3.12-minimal rpcsvc-proto sbuild-build-depends-main-dummy swig
valgrind xxd zlib1g-dev
0 upgraded, 136 newly installed, 0 to remove and 0 not upgraded.
Need to get 150 MB of archives.
After this operation, 826 MB of additional disk space will be used.
Get:1 copy:/<<RESOLVERDIR>>/apt_archive ./ sbuild-build-depends-main-dummy 0.invalid.0 [1036 B]
Get:2 http://deb.debian.org/debian sid/main arm64 libpython3.12-minimal arm64 3.12.7-3 [808 kB]
Get:3 http://deb.debian.org/debian sid/main arm64 libexpat1 arm64 2.6.4-1 [90.7 kB]
Get:4 http://deb.debian.org/debian sid/main arm64 python3.12-minimal arm64 3.12.7-3 [1940 kB]
Get:5 http://deb.debian.org/debian sid/main arm64 python3-minimal arm64 3.12.7-1 [26.8 kB]
Get:6 http://deb.debian.org/debian sid/main arm64 media-types all 10.1.0 [26.9 kB]
Get:7 http://deb.debian.org/debian sid/main arm64 libncursesw6 arm64 6.5-2+b1 [125 kB]
Get:8 http://deb.debian.org/debian sid/main arm64 libtirpc-common all 1.3.4+ds-1.3 [10.9 kB]
Get:9 http://deb.debian.org/debian sid/main arm64 libtirpc3t64 arm64 1.3.4+ds-1.3+b1 [78.7 kB]
Get:10 http://deb.debian.org/debian sid/main arm64 libnsl2 arm64 1.3.0-3+b3 [37.9 kB]
Get:11 http://deb.debian.org/debian sid/main arm64 libpython3.12-stdlib arm64 3.12.7-3 [1902 kB]
Get:12 http://deb.debian.org/debian sid/main arm64 python3.12 arm64 3.12.7-3 [671 kB]
Get:13 http://deb.debian.org/debian sid/main arm64 libpython3-stdlib arm64 3.12.7-1 [9708 B]
Get:14 http://deb.debian.org/debian sid/main arm64 python3 arm64 3.12.7-1 [27.8 kB]
Get:15 http://deb.debian.org/debian sid/main arm64 libproc2-0 arm64 2:4.0.4-6 [62.3 kB]
Get:16 http://deb.debian.org/debian sid/main arm64 procps arm64 2:4.0.4-6 [872 kB]
Get:17 http://deb.debian.org/debian sid/main arm64 m4 arm64 1.4.19-4 [277 kB]
Get:18 http://deb.debian.org/debian sid/main arm64 autoconf all 2.72-3 [493 kB]
Get:19 http://deb.debian.org/debian sid/main arm64 autotools-dev all 20220109.1 [51.6 kB]
Get:20 http://deb.debian.org/debian sid/main arm64 automake all 1:1.16.5-1.3 [823 kB]
Get:21 http://deb.debian.org/debian sid/main arm64 autopoint all 0.22.5-2 [723 kB]
Get:22 http://deb.debian.org/debian sid/main arm64 libc-dev-bin arm64 2.40-3 [50.9 kB]
Get:23 http://deb.debian.org/debian sid/main arm64 linux-libc-dev all 6.11.7-1 [2454 kB]
Get:24 http://deb.debian.org/debian sid/main arm64 libcrypt-dev arm64 1:4.4.36-5 [122 kB]
Get:25 http://deb.debian.org/debian sid/main arm64 rpcsvc-proto arm64 1.4.3-1+b1 [60.5 kB]
Get:26 http://deb.debian.org/debian sid/main arm64 libc6-dev arm64 2.40-3 [1591 kB]
Get:27 http://deb.debian.org/debian sid/main arm64 libisl23 arm64 0.27-1 [601 kB]
Get:28 http://deb.debian.org/debian sid/main arm64 libmpfr6 arm64 4.2.1-1+b2 [680 kB]
Get:29 http://deb.debian.org/debian sid/main arm64 libmpc3 arm64 1.3.1-1+b3 [50.5 kB]
Get:30 http://deb.debian.org/debian sid/main arm64 cpp-14-aarch64-linux-gnu arm64 14.2.0-8 [9166 kB]
Get:31 http://deb.debian.org/debian sid/main arm64 cpp-14 arm64 14.2.0-8 [1284 B]
Get:32 http://deb.debian.org/debian sid/main arm64 cpp-aarch64-linux-gnu arm64 4:14.2.0-1 [4832 B]
Get:33 http://deb.debian.org/debian sid/main arm64 cpp arm64 4:14.2.0-1 [1568 B]
Get:34 http://deb.debian.org/debian sid/main arm64 libcc1-0 arm64 14.2.0-8 [42.2 kB]
Get:35 http://deb.debian.org/debian sid/main arm64 libitm1 arm64 14.2.0-8 [24.2 kB]
Get:36 http://deb.debian.org/debian sid/main arm64 libasan8 arm64 14.2.0-8 [2579 kB]
Get:37 http://deb.debian.org/debian sid/main arm64 liblsan0 arm64 14.2.0-8 [1161 kB]
Get:38 http://deb.debian.org/debian sid/main arm64 libtsan2 arm64 14.2.0-8 [2386 kB]
Get:39 http://deb.debian.org/debian sid/main arm64 libubsan1 arm64 14.2.0-8 [1039 kB]
Get:40 http://deb.debian.org/debian sid/main arm64 libhwasan0 arm64 14.2.0-8 [1442 kB]
Get:41 http://deb.debian.org/debian sid/main arm64 libgcc-14-dev arm64 14.2.0-8 [2365 kB]
Get:42 http://deb.debian.org/debian sid/main arm64 gcc-14-aarch64-linux-gnu arm64 14.2.0-8 [17.7 MB]
Get:43 http://deb.debian.org/debian sid/main arm64 gcc-14 arm64 14.2.0-8 [519 kB]
Get:44 http://deb.debian.org/debian sid/main arm64 gcc-aarch64-linux-gnu arm64 4:14.2.0-1 [1440 B]
Get:45 http://deb.debian.org/debian sid/main arm64 gcc arm64 4:14.2.0-1 [5136 B]
Get:46 http://deb.debian.org/debian sid/main arm64 libstdc++-14-dev arm64 14.2.0-8 [2267 kB]
Get:47 http://deb.debian.org/debian sid/main arm64 g++-14-aarch64-linux-gnu arm64 14.2.0-8 [10.1 MB]
Get:48 http://deb.debian.org/debian sid/main arm64 g++-14 arm64 14.2.0-8 [20.2 kB]
Get:49 http://deb.debian.org/debian sid/main arm64 g++-aarch64-linux-gnu arm64 4:14.2.0-1 [1200 B]
Get:50 http://deb.debian.org/debian sid/main arm64 g++ arm64 4:14.2.0-1 [1332 B]
Get:51 http://deb.debian.org/debian sid/main arm64 build-essential arm64 12.12 [4624 B]
Get:52 http://deb.debian.org/debian sid/main arm64 chrpath arm64 0.18-1 [13.2 kB]
Get:53 http://deb.debian.org/debian sid/main arm64 cmake-data all 3.31.0-1 [2265 kB]
Get:54 http://deb.debian.org/debian sid/main arm64 libarchive13t64 arm64 3.7.4-1.1 [323 kB]
Get:55 http://deb.debian.org/debian sid/main arm64 libcurl4t64 arm64 8.11.0-1 [322 kB]
Get:56 http://deb.debian.org/debian sid/main arm64 libjsoncpp26 arm64 1.9.6-2 [73.1 kB]
Get:57 http://deb.debian.org/debian sid/main arm64 librhash1 arm64 1.4.5-1 [129 kB]
Get:58 http://deb.debian.org/debian sid/main arm64 libuv1t64 arm64 1.48.0-7 [143 kB]
Get:59 http://deb.debian.org/debian sid/main arm64 cmake arm64 3.31.0-1 [9874 kB]
Get:60 http://deb.debian.org/debian sid/main arm64 libdebhelper-perl all 13.20 [89.7 kB]
Get:61 http://deb.debian.org/debian sid/main arm64 libtool all 2.4.7-8 [517 kB]
Get:62 http://deb.debian.org/debian sid/main arm64 dh-autoreconf all 20 [17.1 kB]
Get:63 http://deb.debian.org/debian sid/main arm64 libfile-stripnondeterminism-perl all 1.14.0-1 [19.5 kB]
Get:64 http://deb.debian.org/debian sid/main arm64 dh-strip-nondeterminism all 1.14.0-1 [8448 B]
Get:65 http://deb.debian.org/debian sid/main arm64 libelf1t64 arm64 0.192-4 [189 kB]
Get:66 http://deb.debian.org/debian sid/main arm64 dwz arm64 0.15-1+b1 [102 kB]
Get:67 http://deb.debian.org/debian sid/main arm64 po-debconf all 1.0.21+nmu1 [248 kB]
Get:68 http://deb.debian.org/debian sid/main arm64 debhelper all 13.20 [915 kB]
Get:69 http://deb.debian.org/debian sid/main arm64 python3-autocommand all 2.2.2-3 [13.6 kB]
Get:70 http://deb.debian.org/debian sid/main arm64 python3-more-itertools all 10.5.0-1 [63.8 kB]
Get:71 http://deb.debian.org/debian sid/main arm64 python3-typing-extensions all 4.12.2-2 [73.0 kB]
Get:72 http://deb.debian.org/debian sid/main arm64 python3-typeguard all 4.4.1-1 [37.0 kB]
Get:73 http://deb.debian.org/debian sid/main arm64 python3-inflect all 7.3.1-2 [32.4 kB]
Get:74 http://deb.debian.org/debian sid/main arm64 python3-jaraco.context all 6.0.0-1 [7984 B]
Get:75 http://deb.debian.org/debian sid/main arm64 python3-jaraco.functools all 4.1.0-1 [12.0 kB]
Get:76 http://deb.debian.org/debian sid/main arm64 python3-pkg-resources all 75.2.0-1 [213 kB]
Get:77 http://deb.debian.org/debian sid/main arm64 python3-jaraco.text all 4.0.0-1 [11.4 kB]
Get:78 http://deb.debian.org/debian sid/main arm64 python3-zipp all 3.21.0-1 [10.6 kB]
Get:79 http://deb.debian.org/debian sid/main arm64 python3-setuptools all 75.2.0-1 [731 kB]
Get:80 http://deb.debian.org/debian sid/main arm64 dh-python all 6.20241024 [109 kB]
Get:81 http://deb.debian.org/debian sid/main arm64 libfakeroot arm64 1.36-1 [29.1 kB]
Get:82 http://deb.debian.org/debian sid/main arm64 fakeroot arm64 1.36-1 [74.4 kB]
Get:83 http://deb.debian.org/debian sid/main arm64 libflatbuffers23.5.26 arm64 23.5.26+dfsg-1.1+b1 [174 kB]
Get:84 http://deb.debian.org/debian sid/main arm64 flatbuffers-compiler arm64 23.5.26+dfsg-1.1+b1 [847 kB]
Get:85 http://deb.debian.org/debian sid/main arm64 flatbuffers-compiler-dev arm64 23.5.26+dfsg-1.1+b1 [14.6 kB]
Get:86 http://deb.debian.org/debian sid/main arm64 icu-devtools arm64 72.1-5+b1 [195 kB]
Get:87 http://deb.debian.org/debian sid/main arm64 libarm-compute32t64 arm64 23.08+dfsg-3.1 [2860 kB]
Get:88 http://deb.debian.org/debian sid/main arm64 libarm-compute-dev arm64 23.08+dfsg-3.1 [4329 kB]
Get:89 http://deb.debian.org/debian sid/main arm64 libblas3 arm64 3.12.0-3+b1 [98.9 kB]
Get:90 http://deb.debian.org/debian sid/main arm64 libboost1.83-dev arm64 1.83.0-3.2+b1 [10.6 MB]
Get:91 http://deb.debian.org/debian sid/main arm64 libboost-atomic1.83.0 arm64 1.83.0-3.2+b1 [234 kB]
Get:92 http://deb.debian.org/debian sid/main arm64 libboost-atomic1.83-dev arm64 1.83.0-3.2+b1 [234 kB]
Get:93 http://deb.debian.org/debian sid/main arm64 libboost-chrono1.83.0t64 arm64 1.83.0-3.2+b1 [239 kB]
Get:94 http://deb.debian.org/debian sid/main arm64 libboost-chrono1.83-dev arm64 1.83.0-3.2+b1 [245 kB]
Get:95 http://deb.debian.org/debian sid/main arm64 libboost-date-time1.83.0 arm64 1.83.0-3.2+b1 [230 kB]
Get:96 http://deb.debian.org/debian sid/main arm64 libboost-serialization1.83.0 arm64 1.83.0-3.2+b1 [325 kB]
Get:97 http://deb.debian.org/debian sid/main arm64 libboost-serialization1.83-dev arm64 1.83.0-3.2+b1 [374 kB]
Get:98 http://deb.debian.org/debian sid/main arm64 libboost-date-time1.83-dev arm64 1.83.0-3.2+b1 [239 kB]
Get:99 http://deb.debian.org/debian sid/main arm64 libboost-filesystem1.83.0 arm64 1.83.0-3.2+b1 [273 kB]
Get:100 http://deb.debian.org/debian sid/main arm64 libboost-system1.83.0 arm64 1.83.0-3.2+b1 [231 kB]
Get:101 http://deb.debian.org/debian sid/main arm64 libboost-system1.83-dev arm64 1.83.0-3.2+b1 [232 kB]
Get:102 http://deb.debian.org/debian sid/main arm64 libboost-filesystem1.83-dev arm64 1.83.0-3.2+b1 [293 kB]
Get:103 http://deb.debian.org/debian sid/main arm64 libboost-filesystem-dev arm64 1.83.0.2+b2 [3616 B]
Get:104 http://deb.debian.org/debian sid/main arm64 libboost-thread1.83.0 arm64 1.83.0-3.2+b1 [266 kB]
Get:105 http://deb.debian.org/debian sid/main arm64 libboost-log1.83.0 arm64 1.83.0-3.2+b1 [645 kB]
Get:106 http://deb.debian.org/debian sid/main arm64 libboost-regex1.83.0 arm64 1.83.0-3.2+b1 [314 kB]
Get:107 http://deb.debian.org/debian sid/main arm64 libicu-dev arm64 72.1-5+b1 [10.3 MB]
Get:108 http://deb.debian.org/debian sid/main arm64 libboost-regex1.83-dev arm64 1.83.0-3.2+b1 [335 kB]
Get:109 http://deb.debian.org/debian sid/main arm64 libboost-thread1.83-dev arm64 1.83.0-3.2+b1 [276 kB]
Get:110 http://deb.debian.org/debian sid/main arm64 libboost-log1.83-dev arm64 1.83.0-3.2+b1 [851 kB]
Get:111 http://deb.debian.org/debian sid/main arm64 libboost-log-dev arm64 1.83.0.2+b2 [3788 B]
Get:112 http://deb.debian.org/debian sid/main arm64 libboost-program-options1.83.0 arm64 1.83.0-3.2+b1 [331 kB]
Get:113 http://deb.debian.org/debian sid/main arm64 libboost-program-options1.83-dev arm64 1.83.0-3.2+b1 [369 kB]
Get:114 http://deb.debian.org/debian sid/main arm64 libboost-program-options-dev arm64 1.83.0.2+b2 [3600 B]
Get:115 http://deb.debian.org/debian sid/main arm64 libboost-system-dev arm64 1.83.0.2+b2 [3720 B]
Get:116 http://deb.debian.org/debian sid/main arm64 libboost-test1.83.0 arm64 1.83.0-3.2+b1 [438 kB]
Get:117 http://deb.debian.org/debian sid/main arm64 libboost-test1.83-dev arm64 1.83.0-3.2+b1 [528 kB]
Get:118 http://deb.debian.org/debian sid/main arm64 libboost-test-dev arm64 1.83.0.2+b2 [3620 B]
Get:119 http://deb.debian.org/debian sid/main arm64 libc6-dbg arm64 2.40-3 [6477 kB]
Get:120 http://deb.debian.org/debian sid/main arm64 libexpat1-dev arm64 2.6.4-1 [143 kB]
Get:121 http://deb.debian.org/debian sid/main arm64 libflatbuffers-dev arm64 23.5.26+dfsg-1.1+b1 [278 kB]
Get:122 http://deb.debian.org/debian sid/main arm64 libgfortran5 arm64 14.2.0-8 [361 kB]
Get:123 http://deb.debian.org/debian sid/main arm64 libjs-jquery all 3.6.1+dfsg+~3.5.14-1 [326 kB]
Get:124 http://deb.debian.org/debian sid/main arm64 libjs-underscore all 1.13.4~dfsg+~1.11.4-3 [116 kB]
Get:125 http://deb.debian.org/debian sid/main arm64 libjs-sphinxdoc all 7.4.7-4 [158 kB]
Get:126 http://deb.debian.org/debian sid/main arm64 liblapack3 arm64 3.12.0-3+b1 [1812 kB]
Get:127 http://deb.debian.org/debian sid/main arm64 libpython3.12t64 arm64 3.12.7-3 [1982 kB]
Get:128 http://deb.debian.org/debian sid/main arm64 zlib1g-dev arm64 1:1.3.dfsg+really1.3.1-1+b1 [917 kB]
Get:129 http://deb.debian.org/debian sid/main arm64 libpython3.12-dev arm64 3.12.7-3 [4792 kB]
Get:130 http://deb.debian.org/debian sid/main arm64 libpython3-dev arm64 3.12.7-1 [9980 B]
Get:131 http://deb.debian.org/debian sid/main arm64 python3.12-dev arm64 3.12.7-3 [505 kB]
Get:132 http://deb.debian.org/debian sid/main arm64 python3-dev arm64 3.12.7-1 [26.1 kB]
Get:133 http://deb.debian.org/debian sid/main arm64 python3-numpy arm64 1:1.26.4+ds-12 [3816 kB]
Get:134 http://deb.debian.org/debian sid/main arm64 swig arm64 4.2.1-1+b1 [1355 kB]
Get:135 http://deb.debian.org/debian sid/main arm64 valgrind arm64 1:3.20.0-2.1 [7947 kB]
Get:136 http://deb.debian.org/debian sid/main arm64 xxd arm64 2:9.1.0861-1 [97.7 kB]
debconf: delaying package configuration, since apt-utils is not installed
Fetched 150 MB in 2s (81.9 MB/s)
Selecting previously unselected package libpython3.12-minimal:arm64.
(Reading database ... 17121 files and directories currently installed.)
Preparing to unpack .../libpython3.12-minimal_3.12.7-3_arm64.deb ...
Unpacking libpython3.12-minimal:arm64 (3.12.7-3) ...
Selecting previously unselected package libexpat1:arm64.
Preparing to unpack .../libexpat1_2.6.4-1_arm64.deb ...
Unpacking libexpat1:arm64 (2.6.4-1) ...
Selecting previously unselected package python3.12-minimal.
Preparing to unpack .../python3.12-minimal_3.12.7-3_arm64.deb ...
Unpacking python3.12-minimal (3.12.7-3) ...
Setting up libpython3.12-minimal:arm64 (3.12.7-3) ...
Setting up libexpat1:arm64 (2.6.4-1) ...
Setting up python3.12-minimal (3.12.7-3) ...
Selecting previously unselected package python3-minimal.
(Reading database ... 17441 files and directories currently installed.)
Preparing to unpack .../0-python3-minimal_3.12.7-1_arm64.deb ...
Unpacking python3-minimal (3.12.7-1) ...
Selecting previously unselected package media-types.
Preparing to unpack .../1-media-types_10.1.0_all.deb ...
Unpacking media-types (10.1.0) ...
Selecting previously unselected package libncursesw6:arm64.
Preparing to unpack .../2-libncursesw6_6.5-2+b1_arm64.deb ...
Unpacking libncursesw6:arm64 (6.5-2+b1) ...
Selecting previously unselected package libtirpc-common.
Preparing to unpack .../3-libtirpc-common_1.3.4+ds-1.3_all.deb ...
Unpacking libtirpc-common (1.3.4+ds-1.3) ...
Selecting previously unselected package libtirpc3t64:arm64.
Preparing to unpack .../4-libtirpc3t64_1.3.4+ds-1.3+b1_arm64.deb ...
Adding 'diversion of /lib/aarch64-linux-gnu/libtirpc.so.3 to /lib/aarch64-linux-gnu/libtirpc.so.3.usr-is-merged by libtirpc3t64'
Adding 'diversion of /lib/aarch64-linux-gnu/libtirpc.so.3.0.0 to /lib/aarch64-linux-gnu/libtirpc.so.3.0.0.usr-is-merged by libtirpc3t64'
Unpacking libtirpc3t64:arm64 (1.3.4+ds-1.3+b1) ...
Selecting previously unselected package libnsl2:arm64.
Preparing to unpack .../5-libnsl2_1.3.0-3+b3_arm64.deb ...
Unpacking libnsl2:arm64 (1.3.0-3+b3) ...
Selecting previously unselected package libpython3.12-stdlib:arm64.
Preparing to unpack .../6-libpython3.12-stdlib_3.12.7-3_arm64.deb ...
Unpacking libpython3.12-stdlib:arm64 (3.12.7-3) ...
Selecting previously unselected package python3.12.
Preparing to unpack .../7-python3.12_3.12.7-3_arm64.deb ...
Unpacking python3.12 (3.12.7-3) ...
Selecting previously unselected package libpython3-stdlib:arm64.
Preparing to unpack .../8-libpython3-stdlib_3.12.7-1_arm64.deb ...
Unpacking libpython3-stdlib:arm64 (3.12.7-1) ...
Setting up python3-minimal (3.12.7-1) ...
Selecting previously unselected package python3.
(Reading database ... 17914 files and directories currently installed.)
Preparing to unpack .../000-python3_3.12.7-1_arm64.deb ...
Unpacking python3 (3.12.7-1) ...
Selecting previously unselected package libproc2-0:arm64.
Preparing to unpack .../001-libproc2-0_2%3a4.0.4-6_arm64.deb ...
Unpacking libproc2-0:arm64 (2:4.0.4-6) ...
Selecting previously unselected package procps.
Preparing to unpack .../002-procps_2%3a4.0.4-6_arm64.deb ...
Unpacking procps (2:4.0.4-6) ...
Selecting previously unselected package m4.
Preparing to unpack .../003-m4_1.4.19-4_arm64.deb ...
Unpacking m4 (1.4.19-4) ...
Selecting previously unselected package autoconf.
Preparing to unpack .../004-autoconf_2.72-3_all.deb ...
Unpacking autoconf (2.72-3) ...
Selecting previously unselected package autotools-dev.
Preparing to unpack .../005-autotools-dev_20220109.1_all.deb ...
Unpacking autotools-dev (20220109.1) ...
Selecting previously unselected package automake.
Preparing to unpack .../006-automake_1%3a1.16.5-1.3_all.deb ...
Unpacking automake (1:1.16.5-1.3) ...
Selecting previously unselected package autopoint.
Preparing to unpack .../007-autopoint_0.22.5-2_all.deb ...
Unpacking autopoint (0.22.5-2) ...
Selecting previously unselected package libc-dev-bin.
Preparing to unpack .../008-libc-dev-bin_2.40-3_arm64.deb ...
Unpacking libc-dev-bin (2.40-3) ...
Selecting previously unselected package linux-libc-dev.
Preparing to unpack .../009-linux-libc-dev_6.11.7-1_all.deb ...
Unpacking linux-libc-dev (6.11.7-1) ...
Selecting previously unselected package libcrypt-dev:arm64.
Preparing to unpack .../010-libcrypt-dev_1%3a4.4.36-5_arm64.deb ...
Unpacking libcrypt-dev:arm64 (1:4.4.36-5) ...
Selecting previously unselected package rpcsvc-proto.
Preparing to unpack .../011-rpcsvc-proto_1.4.3-1+b1_arm64.deb ...
Unpacking rpcsvc-proto (1.4.3-1+b1) ...
Selecting previously unselected package libc6-dev:arm64.
Preparing to unpack .../012-libc6-dev_2.40-3_arm64.deb ...
Unpacking libc6-dev:arm64 (2.40-3) ...
Selecting previously unselected package libisl23:arm64.
Preparing to unpack .../013-libisl23_0.27-1_arm64.deb ...
Unpacking libisl23:arm64 (0.27-1) ...
Selecting previously unselected package libmpfr6:arm64.
Preparing to unpack .../014-libmpfr6_4.2.1-1+b2_arm64.deb ...
Unpacking libmpfr6:arm64 (4.2.1-1+b2) ...
Selecting previously unselected package libmpc3:arm64.
Preparing to unpack .../015-libmpc3_1.3.1-1+b3_arm64.deb ...
Unpacking libmpc3:arm64 (1.3.1-1+b3) ...
Selecting previously unselected package cpp-14-aarch64-linux-gnu.
Preparing to unpack .../016-cpp-14-aarch64-linux-gnu_14.2.0-8_arm64.deb ...
Unpacking cpp-14-aarch64-linux-gnu (14.2.0-8) ...
Selecting previously unselected package cpp-14.
Preparing to unpack .../017-cpp-14_14.2.0-8_arm64.deb ...
Unpacking cpp-14 (14.2.0-8) ...
Selecting previously unselected package cpp-aarch64-linux-gnu.
Preparing to unpack .../018-cpp-aarch64-linux-gnu_4%3a14.2.0-1_arm64.deb ...
Unpacking cpp-aarch64-linux-gnu (4:14.2.0-1) ...
Selecting previously unselected package cpp.
Preparing to unpack .../019-cpp_4%3a14.2.0-1_arm64.deb ...
Unpacking cpp (4:14.2.0-1) ...
Selecting previously unselected package libcc1-0:arm64.
Preparing to unpack .../020-libcc1-0_14.2.0-8_arm64.deb ...
Unpacking libcc1-0:arm64 (14.2.0-8) ...
Selecting previously unselected package libitm1:arm64.
Preparing to unpack .../021-libitm1_14.2.0-8_arm64.deb ...
Unpacking libitm1:arm64 (14.2.0-8) ...
Selecting previously unselected package libasan8:arm64.
Preparing to unpack .../022-libasan8_14.2.0-8_arm64.deb ...
Unpacking libasan8:arm64 (14.2.0-8) ...
Selecting previously unselected package liblsan0:arm64.
Preparing to unpack .../023-liblsan0_14.2.0-8_arm64.deb ...
Unpacking liblsan0:arm64 (14.2.0-8) ...
Selecting previously unselected package libtsan2:arm64.
Preparing to unpack .../024-libtsan2_14.2.0-8_arm64.deb ...
Unpacking libtsan2:arm64 (14.2.0-8) ...
Selecting previously unselected package libubsan1:arm64.
Preparing to unpack .../025-libubsan1_14.2.0-8_arm64.deb ...
Unpacking libubsan1:arm64 (14.2.0-8) ...
Selecting previously unselected package libhwasan0:arm64.
Preparing to unpack .../026-libhwasan0_14.2.0-8_arm64.deb ...
Unpacking libhwasan0:arm64 (14.2.0-8) ...
Selecting previously unselected package libgcc-14-dev:arm64.
Preparing to unpack .../027-libgcc-14-dev_14.2.0-8_arm64.deb ...
Unpacking libgcc-14-dev:arm64 (14.2.0-8) ...
Selecting previously unselected package gcc-14-aarch64-linux-gnu.
Preparing to unpack .../028-gcc-14-aarch64-linux-gnu_14.2.0-8_arm64.deb ...
Unpacking gcc-14-aarch64-linux-gnu (14.2.0-8) ...
Selecting previously unselected package gcc-14.
Preparing to unpack .../029-gcc-14_14.2.0-8_arm64.deb ...
Unpacking gcc-14 (14.2.0-8) ...
Selecting previously unselected package gcc-aarch64-linux-gnu.
Preparing to unpack .../030-gcc-aarch64-linux-gnu_4%3a14.2.0-1_arm64.deb ...
Unpacking gcc-aarch64-linux-gnu (4:14.2.0-1) ...
Selecting previously unselected package gcc.
Preparing to unpack .../031-gcc_4%3a14.2.0-1_arm64.deb ...
Unpacking gcc (4:14.2.0-1) ...
Selecting previously unselected package libstdc++-14-dev:arm64.
Preparing to unpack .../032-libstdc++-14-dev_14.2.0-8_arm64.deb ...
Unpacking libstdc++-14-dev:arm64 (14.2.0-8) ...
Selecting previously unselected package g++-14-aarch64-linux-gnu.
Preparing to unpack .../033-g++-14-aarch64-linux-gnu_14.2.0-8_arm64.deb ...
Unpacking g++-14-aarch64-linux-gnu (14.2.0-8) ...
Selecting previously unselected package g++-14.
Preparing to unpack .../034-g++-14_14.2.0-8_arm64.deb ...
Unpacking g++-14 (14.2.0-8) ...
Selecting previously unselected package g++-aarch64-linux-gnu.
Preparing to unpack .../035-g++-aarch64-linux-gnu_4%3a14.2.0-1_arm64.deb ...
Unpacking g++-aarch64-linux-gnu (4:14.2.0-1) ...
Selecting previously unselected package g++.
Preparing to unpack .../036-g++_4%3a14.2.0-1_arm64.deb ...
Unpacking g++ (4:14.2.0-1) ...
Selecting previously unselected package build-essential.
Preparing to unpack .../037-build-essential_12.12_arm64.deb ...
Unpacking build-essential (12.12) ...
Selecting previously unselected package chrpath.
Preparing to unpack .../038-chrpath_0.18-1_arm64.deb ...
Unpacking chrpath (0.18-1) ...
Selecting previously unselected package cmake-data.
Preparing to unpack .../039-cmake-data_3.31.0-1_all.deb ...
Unpacking cmake-data (3.31.0-1) ...
Selecting previously unselected package libarchive13t64:arm64.
Preparing to unpack .../040-libarchive13t64_3.7.4-1.1_arm64.deb ...
Unpacking libarchive13t64:arm64 (3.7.4-1.1) ...
Selecting previously unselected package libcurl4t64:arm64.
Preparing to unpack .../041-libcurl4t64_8.11.0-1_arm64.deb ...
Unpacking libcurl4t64:arm64 (8.11.0-1) ...
Selecting previously unselected package libjsoncpp26:arm64.
Preparing to unpack .../042-libjsoncpp26_1.9.6-2_arm64.deb ...
Unpacking libjsoncpp26:arm64 (1.9.6-2) ...
Selecting previously unselected package librhash1:arm64.
Preparing to unpack .../043-librhash1_1.4.5-1_arm64.deb ...
Unpacking librhash1:arm64 (1.4.5-1) ...
Selecting previously unselected package libuv1t64:arm64.
Preparing to unpack .../044-libuv1t64_1.48.0-7_arm64.deb ...
Unpacking libuv1t64:arm64 (1.48.0-7) ...
Selecting previously unselected package cmake.
Preparing to unpack .../045-cmake_3.31.0-1_arm64.deb ...
Unpacking cmake (3.31.0-1) ...
Selecting previously unselected package libdebhelper-perl.
Preparing to unpack .../046-libdebhelper-perl_13.20_all.deb ...
Unpacking libdebhelper-perl (13.20) ...
Selecting previously unselected package libtool.
Preparing to unpack .../047-libtool_2.4.7-8_all.deb ...
Unpacking libtool (2.4.7-8) ...
Selecting previously unselected package dh-autoreconf.
Preparing to unpack .../048-dh-autoreconf_20_all.deb ...
Unpacking dh-autoreconf (20) ...
Selecting previously unselected package libfile-stripnondeterminism-perl.
Preparing to unpack .../049-libfile-stripnondeterminism-perl_1.14.0-1_all.deb ...
Unpacking libfile-stripnondeterminism-perl (1.14.0-1) ...
Selecting previously unselected package dh-strip-nondeterminism.
Preparing to unpack .../050-dh-strip-nondeterminism_1.14.0-1_all.deb ...
Unpacking dh-strip-nondeterminism (1.14.0-1) ...
Selecting previously unselected package libelf1t64:arm64.
Preparing to unpack .../051-libelf1t64_0.192-4_arm64.deb ...
Unpacking libelf1t64:arm64 (0.192-4) ...
Selecting previously unselected package dwz.
Preparing to unpack .../052-dwz_0.15-1+b1_arm64.deb ...
Unpacking dwz (0.15-1+b1) ...
Selecting previously unselected package po-debconf.
Preparing to unpack .../053-po-debconf_1.0.21+nmu1_all.deb ...
Unpacking po-debconf (1.0.21+nmu1) ...
Selecting previously unselected package debhelper.
Preparing to unpack .../054-debhelper_13.20_all.deb ...
Unpacking debhelper (13.20) ...
Selecting previously unselected package python3-autocommand.
Preparing to unpack .../055-python3-autocommand_2.2.2-3_all.deb ...
Unpacking python3-autocommand (2.2.2-3) ...
Selecting previously unselected package python3-more-itertools.
Preparing to unpack .../056-python3-more-itertools_10.5.0-1_all.deb ...
Unpacking python3-more-itertools (10.5.0-1) ...
Selecting previously unselected package python3-typing-extensions.
Preparing to unpack .../057-python3-typing-extensions_4.12.2-2_all.deb ...
Unpacking python3-typing-extensions (4.12.2-2) ...
Selecting previously unselected package python3-typeguard.
Preparing to unpack .../058-python3-typeguard_4.4.1-1_all.deb ...
Unpacking python3-typeguard (4.4.1-1) ...
Selecting previously unselected package python3-inflect.
Preparing to unpack .../059-python3-inflect_7.3.1-2_all.deb ...
Unpacking python3-inflect (7.3.1-2) ...
Selecting previously unselected package python3-jaraco.context.
Preparing to unpack .../060-python3-jaraco.context_6.0.0-1_all.deb ...
Unpacking python3-jaraco.context (6.0.0-1) ...
Selecting previously unselected package python3-jaraco.functools.
Preparing to unpack .../061-python3-jaraco.functools_4.1.0-1_all.deb ...
Unpacking python3-jaraco.functools (4.1.0-1) ...
Selecting previously unselected package python3-pkg-resources.
Preparing to unpack .../062-python3-pkg-resources_75.2.0-1_all.deb ...
Unpacking python3-pkg-resources (75.2.0-1) ...
Selecting previously unselected package python3-jaraco.text.
Preparing to unpack .../063-python3-jaraco.text_4.0.0-1_all.deb ...
Unpacking python3-jaraco.text (4.0.0-1) ...
Selecting previously unselected package python3-zipp.
Preparing to unpack .../064-python3-zipp_3.21.0-1_all.deb ...
Unpacking python3-zipp (3.21.0-1) ...
Selecting previously unselected package python3-setuptools.
Preparing to unpack .../065-python3-setuptools_75.2.0-1_all.deb ...
Unpacking python3-setuptools (75.2.0-1) ...
Selecting previously unselected package dh-python.
Preparing to unpack .../066-dh-python_6.20241024_all.deb ...
Unpacking dh-python (6.20241024) ...
Selecting previously unselected package libfakeroot:arm64.
Preparing to unpack .../067-libfakeroot_1.36-1_arm64.deb ...
Unpacking libfakeroot:arm64 (1.36-1) ...
Selecting previously unselected package fakeroot.
Preparing to unpack .../068-fakeroot_1.36-1_arm64.deb ...
Unpacking fakeroot (1.36-1) ...
Selecting previously unselected package libflatbuffers23.5.26:arm64.
Preparing to unpack .../069-libflatbuffers23.5.26_23.5.26+dfsg-1.1+b1_arm64.deb ...
Unpacking libflatbuffers23.5.26:arm64 (23.5.26+dfsg-1.1+b1) ...
Selecting previously unselected package flatbuffers-compiler.
Preparing to unpack .../070-flatbuffers-compiler_23.5.26+dfsg-1.1+b1_arm64.deb ...
Unpacking flatbuffers-compiler (23.5.26+dfsg-1.1+b1) ...
Selecting previously unselected package flatbuffers-compiler-dev:arm64.
Preparing to unpack .../071-flatbuffers-compiler-dev_23.5.26+dfsg-1.1+b1_arm64.deb ...
Unpacking flatbuffers-compiler-dev:arm64 (23.5.26+dfsg-1.1+b1) ...
Selecting previously unselected package icu-devtools.
Preparing to unpack .../072-icu-devtools_72.1-5+b1_arm64.deb ...
Unpacking icu-devtools (72.1-5+b1) ...
Selecting previously unselected package libarm-compute32t64:arm64.
Preparing to unpack .../073-libarm-compute32t64_23.08+dfsg-3.1_arm64.deb ...
Unpacking libarm-compute32t64:arm64 (23.08+dfsg-3.1) ...
Selecting previously unselected package libarm-compute-dev:arm64.
Preparing to unpack .../074-libarm-compute-dev_23.08+dfsg-3.1_arm64.deb ...
Unpacking libarm-compute-dev:arm64 (23.08+dfsg-3.1) ...
Selecting previously unselected package libblas3:arm64.
Preparing to unpack .../075-libblas3_3.12.0-3+b1_arm64.deb ...
Unpacking libblas3:arm64 (3.12.0-3+b1) ...
Selecting previously unselected package libboost1.83-dev:arm64.
Preparing to unpack .../076-libboost1.83-dev_1.83.0-3.2+b1_arm64.deb ...
Unpacking libboost1.83-dev:arm64 (1.83.0-3.2+b1) ...
Selecting previously unselected package libboost-atomic1.83.0:arm64.
Preparing to unpack .../077-libboost-atomic1.83.0_1.83.0-3.2+b1_arm64.deb ...
Unpacking libboost-atomic1.83.0:arm64 (1.83.0-3.2+b1) ...
Selecting previously unselected package libboost-atomic1.83-dev:arm64.
Preparing to unpack .../078-libboost-atomic1.83-dev_1.83.0-3.2+b1_arm64.deb ...
Unpacking libboost-atomic1.83-dev:arm64 (1.83.0-3.2+b1) ...
Selecting previously unselected package libboost-chrono1.83.0t64:arm64.
Preparing to unpack .../079-libboost-chrono1.83.0t64_1.83.0-3.2+b1_arm64.deb ...
Unpacking libboost-chrono1.83.0t64:arm64 (1.83.0-3.2+b1) ...
Selecting previously unselected package libboost-chrono1.83-dev:arm64.
Preparing to unpack .../080-libboost-chrono1.83-dev_1.83.0-3.2+b1_arm64.deb ...
Unpacking libboost-chrono1.83-dev:arm64 (1.83.0-3.2+b1) ...
Selecting previously unselected package libboost-date-time1.83.0:arm64.
Preparing to unpack .../081-libboost-date-time1.83.0_1.83.0-3.2+b1_arm64.deb ...
Unpacking libboost-date-time1.83.0:arm64 (1.83.0-3.2+b1) ...
Selecting previously unselected package libboost-serialization1.83.0:arm64.
Preparing to unpack .../082-libboost-serialization1.83.0_1.83.0-3.2+b1_arm64.deb ...
Unpacking libboost-serialization1.83.0:arm64 (1.83.0-3.2+b1) ...
Selecting previously unselected package libboost-serialization1.83-dev:arm64.
Preparing to unpack .../083-libboost-serialization1.83-dev_1.83.0-3.2+b1_arm64.deb ...
Unpacking libboost-serialization1.83-dev:arm64 (1.83.0-3.2+b1) ...
Selecting previously unselected package libboost-date-time1.83-dev:arm64.
Preparing to unpack .../084-libboost-date-time1.83-dev_1.83.0-3.2+b1_arm64.deb ...
Unpacking libboost-date-time1.83-dev:arm64 (1.83.0-3.2+b1) ...
Selecting previously unselected package libboost-filesystem1.83.0:arm64.
Preparing to unpack .../085-libboost-filesystem1.83.0_1.83.0-3.2+b1_arm64.deb ...
Unpacking libboost-filesystem1.83.0:arm64 (1.83.0-3.2+b1) ...
Selecting previously unselected package libboost-system1.83.0:arm64.
Preparing to unpack .../086-libboost-system1.83.0_1.83.0-3.2+b1_arm64.deb ...
Unpacking libboost-system1.83.0:arm64 (1.83.0-3.2+b1) ...
Selecting previously unselected package libboost-system1.83-dev:arm64.
Preparing to unpack .../087-libboost-system1.83-dev_1.83.0-3.2+b1_arm64.deb ...
Unpacking libboost-system1.83-dev:arm64 (1.83.0-3.2+b1) ...
Selecting previously unselected package libboost-filesystem1.83-dev:arm64.
Preparing to unpack .../088-libboost-filesystem1.83-dev_1.83.0-3.2+b1_arm64.deb ...
Unpacking libboost-filesystem1.83-dev:arm64 (1.83.0-3.2+b1) ...
Selecting previously unselected package libboost-filesystem-dev:arm64.
Preparing to unpack .../089-libboost-filesystem-dev_1.83.0.2+b2_arm64.deb ...
Unpacking libboost-filesystem-dev:arm64 (1.83.0.2+b2) ...
Selecting previously unselected package libboost-thread1.83.0:arm64.
Preparing to unpack .../090-libboost-thread1.83.0_1.83.0-3.2+b1_arm64.deb ...
Unpacking libboost-thread1.83.0:arm64 (1.83.0-3.2+b1) ...
Selecting previously unselected package libboost-log1.83.0.
Preparing to unpack .../091-libboost-log1.83.0_1.83.0-3.2+b1_arm64.deb ...
Unpacking libboost-log1.83.0 (1.83.0-3.2+b1) ...
Selecting previously unselected package libboost-regex1.83.0:arm64.
Preparing to unpack .../092-libboost-regex1.83.0_1.83.0-3.2+b1_arm64.deb ...
Unpacking libboost-regex1.83.0:arm64 (1.83.0-3.2+b1) ...
Selecting previously unselected package libicu-dev:arm64.
Preparing to unpack .../093-libicu-dev_72.1-5+b1_arm64.deb ...
Unpacking libicu-dev:arm64 (72.1-5+b1) ...
Selecting previously unselected package libboost-regex1.83-dev:arm64.
Preparing to unpack .../094-libboost-regex1.83-dev_1.83.0-3.2+b1_arm64.deb ...
Unpacking libboost-regex1.83-dev:arm64 (1.83.0-3.2+b1) ...
Selecting previously unselected package libboost-thread1.83-dev:arm64.
Preparing to unpack .../095-libboost-thread1.83-dev_1.83.0-3.2+b1_arm64.deb ...
Unpacking libboost-thread1.83-dev:arm64 (1.83.0-3.2+b1) ...
Selecting previously unselected package libboost-log1.83-dev.
Preparing to unpack .../096-libboost-log1.83-dev_1.83.0-3.2+b1_arm64.deb ...
Unpacking libboost-log1.83-dev (1.83.0-3.2+b1) ...
Selecting previously unselected package libboost-log-dev.
Preparing to unpack .../097-libboost-log-dev_1.83.0.2+b2_arm64.deb ...
Unpacking libboost-log-dev (1.83.0.2+b2) ...
Selecting previously unselected package libboost-program-options1.83.0:arm64.
Preparing to unpack .../098-libboost-program-options1.83.0_1.83.0-3.2+b1_arm64.deb ...
Unpacking libboost-program-options1.83.0:arm64 (1.83.0-3.2+b1) ...
Selecting previously unselected package libboost-program-options1.83-dev:arm64.
Preparing to unpack .../099-libboost-program-options1.83-dev_1.83.0-3.2+b1_arm64.deb ...
Unpacking libboost-program-options1.83-dev:arm64 (1.83.0-3.2+b1) ...
Selecting previously unselected package libboost-program-options-dev:arm64.
Preparing to unpack .../100-libboost-program-options-dev_1.83.0.2+b2_arm64.deb ...
Unpacking libboost-program-options-dev:arm64 (1.83.0.2+b2) ...
Selecting previously unselected package libboost-system-dev:arm64.
Preparing to unpack .../101-libboost-system-dev_1.83.0.2+b2_arm64.deb ...
Unpacking libboost-system-dev:arm64 (1.83.0.2+b2) ...
Selecting previously unselected package libboost-test1.83.0:arm64.
Preparing to unpack .../102-libboost-test1.83.0_1.83.0-3.2+b1_arm64.deb ...
Unpacking libboost-test1.83.0:arm64 (1.83.0-3.2+b1) ...
Selecting previously unselected package libboost-test1.83-dev:arm64.
Preparing to unpack .../103-libboost-test1.83-dev_1.83.0-3.2+b1_arm64.deb ...
Unpacking libboost-test1.83-dev:arm64 (1.83.0-3.2+b1) ...
Selecting previously unselected package libboost-test-dev:arm64.
Preparing to unpack .../104-libboost-test-dev_1.83.0.2+b2_arm64.deb ...
Unpacking libboost-test-dev:arm64 (1.83.0.2+b2) ...
Selecting previously unselected package libc6-dbg:arm64.
Preparing to unpack .../105-libc6-dbg_2.40-3_arm64.deb ...
Unpacking libc6-dbg:arm64 (2.40-3) ...
Selecting previously unselected package libexpat1-dev:arm64.
Preparing to unpack .../106-libexpat1-dev_2.6.4-1_arm64.deb ...
Unpacking libexpat1-dev:arm64 (2.6.4-1) ...
Selecting previously unselected package libflatbuffers-dev:arm64.
Preparing to unpack .../107-libflatbuffers-dev_23.5.26+dfsg-1.1+b1_arm64.deb ...
Unpacking libflatbuffers-dev:arm64 (23.5.26+dfsg-1.1+b1) ...
Selecting previously unselected package libgfortran5:arm64.
Preparing to unpack .../108-libgfortran5_14.2.0-8_arm64.deb ...
Unpacking libgfortran5:arm64 (14.2.0-8) ...
Selecting previously unselected package libjs-jquery.
Preparing to unpack .../109-libjs-jquery_3.6.1+dfsg+~3.5.14-1_all.deb ...
Unpacking libjs-jquery (3.6.1+dfsg+~3.5.14-1) ...
Selecting previously unselected package libjs-underscore.
Preparing to unpack .../110-libjs-underscore_1.13.4~dfsg+~1.11.4-3_all.deb ...
Unpacking libjs-underscore (1.13.4~dfsg+~1.11.4-3) ...
Selecting previously unselected package libjs-sphinxdoc.
Preparing to unpack .../111-libjs-sphinxdoc_7.4.7-4_all.deb ...
Unpacking libjs-sphinxdoc (7.4.7-4) ...
Selecting previously unselected package liblapack3:arm64.
Preparing to unpack .../112-liblapack3_3.12.0-3+b1_arm64.deb ...
Unpacking liblapack3:arm64 (3.12.0-3+b1) ...
Selecting previously unselected package libpython3.12t64:arm64.
Preparing to unpack .../113-libpython3.12t64_3.12.7-3_arm64.deb ...
Unpacking libpython3.12t64:arm64 (3.12.7-3) ...
Selecting previously unselected package zlib1g-dev:arm64.
Preparing to unpack .../114-zlib1g-dev_1%3a1.3.dfsg+really1.3.1-1+b1_arm64.deb ...
Unpacking zlib1g-dev:arm64 (1:1.3.dfsg+really1.3.1-1+b1) ...
Selecting previously unselected package libpython3.12-dev:arm64.
Preparing to unpack .../115-libpython3.12-dev_3.12.7-3_arm64.deb ...
Unpacking libpython3.12-dev:arm64 (3.12.7-3) ...
Selecting previously unselected package libpython3-dev:arm64.
Preparing to unpack .../116-libpython3-dev_3.12.7-1_arm64.deb ...
Unpacking libpython3-dev:arm64 (3.12.7-1) ...
Selecting previously unselected package python3.12-dev.
Preparing to unpack .../117-python3.12-dev_3.12.7-3_arm64.deb ...
Unpacking python3.12-dev (3.12.7-3) ...
Selecting previously unselected package python3-dev.
Preparing to unpack .../118-python3-dev_3.12.7-1_arm64.deb ...
Unpacking python3-dev (3.12.7-1) ...
Selecting previously unselected package python3-numpy.
Preparing to unpack .../119-python3-numpy_1%3a1.26.4+ds-12_arm64.deb ...
Unpacking python3-numpy (1:1.26.4+ds-12) ...
Selecting previously unselected package swig.
Preparing to unpack .../120-swig_4.2.1-1+b1_arm64.deb ...
Unpacking swig (4.2.1-1+b1) ...
Selecting previously unselected package valgrind.
Preparing to unpack .../121-valgrind_1%3a3.20.0-2.1_arm64.deb ...
Unpacking valgrind (1:3.20.0-2.1) ...
Selecting previously unselected package xxd.
Preparing to unpack .../122-xxd_2%3a9.1.0861-1_arm64.deb ...
Unpacking xxd (2:9.1.0861-1) ...
Selecting previously unselected package sbuild-build-depends-main-dummy.
Preparing to unpack .../123-sbuild-build-depends-main-dummy_0.invalid.0_arm64.deb ...
Unpacking sbuild-build-depends-main-dummy (0.invalid.0) ...
Setting up media-types (10.1.0) ...
Setting up libfile-stripnondeterminism-perl (1.14.0-1) ...
Setting up libboost-program-options1.83.0:arm64 (1.83.0-3.2+b1) ...
Setting up swig (4.2.1-1+b1) ...
Setting up libarm-compute32t64:arm64 (23.08+dfsg-3.1) ...
Setting up libboost-date-time1.83.0:arm64 (1.83.0-3.2+b1) ...
Setting up libcurl4t64:arm64 (8.11.0-1) ...
Setting up libflatbuffers23.5.26:arm64 (23.5.26+dfsg-1.1+b1) ...
Setting up libtirpc-common (1.3.4+ds-1.3) ...
Setting up po-debconf (1.0.21+nmu1) ...
Setting up libboost-regex1.83.0:arm64 (1.83.0-3.2+b1) ...
Setting up libdebhelper-perl (13.20) ...
Setting up libboost-system1.83.0:arm64 (1.83.0-3.2+b1) ...
Setting up libuv1t64:arm64 (1.48.0-7) ...
Setting up linux-libc-dev (6.11.7-1) ...
Setting up libboost-thread1.83.0:arm64 (1.83.0-3.2+b1) ...
Setting up m4 (1.4.19-4) ...
Setting up libboost-filesystem1.83.0:arm64 (1.83.0-3.2+b1) ...
Setting up xxd (2:9.1.0861-1) ...
Setting up libfakeroot:arm64 (1.36-1) ...
Setting up libelf1t64:arm64 (0.192-4) ...
Setting up libc6-dbg:arm64 (2.40-3) ...
Setting up libboost-atomic1.83.0:arm64 (1.83.0-3.2+b1) ...
Setting up fakeroot (1.36-1) ...
update-alternatives: using /usr/bin/fakeroot-sysv to provide /usr/bin/fakeroot (fakeroot) in auto mode
Setting up libboost-serialization1.83.0:arm64 (1.83.0-3.2+b1) ...
Setting up autotools-dev (20220109.1) ...
Setting up libblas3:arm64 (3.12.0-3+b1) ...
update-alternatives: using /usr/lib/aarch64-linux-gnu/blas/libblas.so.3 to provide /usr/lib/aarch64-linux-gnu/libblas.so.3 (libblas.so.3-aarch64-linux-gnu) in auto mode
Setting up rpcsvc-proto (1.4.3-1+b1) ...
Setting up libmpfr6:arm64 (4.2.1-1+b2) ...
Setting up libboost-chrono1.83.0t64:arm64 (1.83.0-3.2+b1) ...
Setting up libjsoncpp26:arm64 (1.9.6-2) ...
Setting up libproc2-0:arm64 (2:4.0.4-6) ...
Setting up libmpc3:arm64 (1.3.1-1+b3) ...
Setting up autopoint (0.22.5-2) ...
Setting up icu-devtools (72.1-5+b1) ...
Setting up libncursesw6:arm64 (6.5-2+b1) ...
Setting up libboost-test1.83.0:arm64 (1.83.0-3.2+b1) ...
Setting up libgfortran5:arm64 (14.2.0-8) ...
Setting up autoconf (2.72-3) ...
Setting up libubsan1:arm64 (14.2.0-8) ...
Setting up dh-strip-nondeterminism (1.14.0-1) ...
Setting up dwz (0.15-1+b1) ...
Setting up libhwasan0:arm64 (14.2.0-8) ...
Setting up libcrypt-dev:arm64 (1:4.4.36-5) ...
Setting up libasan8:arm64 (14.2.0-8) ...
Setting up flatbuffers-compiler (23.5.26+dfsg-1.1+b1) ...
Setting up procps (2:4.0.4-6) ...
Setting up libarm-compute-dev:arm64 (23.08+dfsg-3.1) ...
Setting up cmake-data (3.31.0-1) ...
Setting up librhash1:arm64 (1.4.5-1) ...
Setting up libtsan2:arm64 (14.2.0-8) ...
Setting up libjs-jquery (3.6.1+dfsg+~3.5.14-1) ...
Setting up libisl23:arm64 (0.27-1) ...
Setting up libc-dev-bin (2.40-3) ...
Setting up valgrind (1:3.20.0-2.1) ...
Setting up libarchive13t64:arm64 (3.7.4-1.1) ...
Setting up libcc1-0:arm64 (14.2.0-8) ...
Setting up chrpath (0.18-1) ...
Setting up liblsan0:arm64 (14.2.0-8) ...
Setting up libitm1:arm64 (14.2.0-8) ...
Setting up libjs-underscore (1.13.4~dfsg+~1.11.4-3) ...
Setting up automake (1:1.16.5-1.3) ...
update-alternatives: using /usr/bin/automake-1.16 to provide /usr/bin/automake (automake) in auto mode
Setting up liblapack3:arm64 (3.12.0-3+b1) ...
update-alternatives: using /usr/lib/aarch64-linux-gnu/lapack/liblapack.so.3 to provide /usr/lib/aarch64-linux-gnu/liblapack.so.3 (liblapack.so.3-aarch64-linux-gnu) in auto mode
Setting up libtirpc3t64:arm64 (1.3.4+ds-1.3+b1) ...
Setting up libboost-log1.83.0 (1.83.0-3.2+b1) ...
Setting up flatbuffers-compiler-dev:arm64 (23.5.26+dfsg-1.1+b1) ...
Setting up libjs-sphinxdoc (7.4.7-4) ...
Setting up cpp-14-aarch64-linux-gnu (14.2.0-8) ...
Setting up libnsl2:arm64 (1.3.0-3+b3) ...
Setting up cmake (3.31.0-1) ...
Setting up libc6-dev:arm64 (2.40-3) ...
Setting up libgcc-14-dev:arm64 (14.2.0-8) ...
Setting up libstdc++-14-dev:arm64 (14.2.0-8) ...
Setting up libicu-dev:arm64 (72.1-5+b1) ...
Setting up libboost1.83-dev:arm64 (1.83.0-3.2+b1) ...
Setting up libflatbuffers-dev:arm64 (23.5.26+dfsg-1.1+b1) ...
Setting up libboost-chrono1.83-dev:arm64 (1.83.0-3.2+b1) ...
Setting up libpython3.12-stdlib:arm64 (3.12.7-3) ...
Setting up python3.12 (3.12.7-3) ...
Setting up libboost-program-options1.83-dev:arm64 (1.83.0-3.2+b1) ...
Setting up libboost-serialization1.83-dev:arm64 (1.83.0-3.2+b1) ...
Setting up libboost-test1.83-dev:arm64 (1.83.0-3.2+b1) ...
Setting up libboost-test-dev:arm64 (1.83.0.2+b2) ...
Setting up libpython3.12t64:arm64 (3.12.7-3) ...
Setting up cpp-aarch64-linux-gnu (4:14.2.0-1) ...
Setting up libexpat1-dev:arm64 (2.6.4-1) ...
Setting up libboost-program-options-dev:arm64 (1.83.0.2+b2) ...
Setting up libboost-date-time1.83-dev:arm64 (1.83.0-3.2+b1) ...
Setting up libboost-regex1.83-dev:arm64 (1.83.0-3.2+b1) ...
Setting up libboost-atomic1.83-dev:arm64 (1.83.0-3.2+b1) ...
Setting up cpp-14 (14.2.0-8) ...
Setting up zlib1g-dev:arm64 (1:1.3.dfsg+really1.3.1-1+b1) ...
Setting up cpp (4:14.2.0-1) ...
Setting up gcc-14-aarch64-linux-gnu (14.2.0-8) ...
Setting up libboost-system1.83-dev:arm64 (1.83.0-3.2+b1) ...
Setting up libpython3-stdlib:arm64 (3.12.7-1) ...
Setting up libboost-thread1.83-dev:arm64 (1.83.0-3.2+b1) ...
Setting up gcc-aarch64-linux-gnu (4:14.2.0-1) ...
Setting up g++-14-aarch64-linux-gnu (14.2.0-8) ...
Setting up libboost-system-dev:arm64 (1.83.0.2+b2) ...
Setting up python3 (3.12.7-1) ...
Setting up libpython3.12-dev:arm64 (3.12.7-3) ...
Setting up libboost-filesystem1.83-dev:arm64 (1.83.0-3.2+b1) ...
Setting up python3-zipp (3.21.0-1) ...
Setting up python3-autocommand (2.2.2-3) ...
Setting up gcc-14 (14.2.0-8) ...
Setting up python3.12-dev (3.12.7-3) ...
Setting up python3-typing-extensions (4.12.2-2) ...
Setting up g++-aarch64-linux-gnu (4:14.2.0-1) ...
Setting up g++-14 (14.2.0-8) ...
Setting up libboost-log1.83-dev (1.83.0-3.2+b1) ...
Setting up libboost-log-dev (1.83.0.2+b2) ...
Setting up libboost-filesystem-dev:arm64 (1.83.0.2+b2) ...
Setting up python3-more-itertools (10.5.0-1) ...
Setting up libpython3-dev:arm64 (3.12.7-1) ...
Setting up python3-jaraco.functools (4.1.0-1) ...
Setting up python3-jaraco.context (6.0.0-1) ...
Setting up libtool (2.4.7-8) ...
Setting up python3-typeguard (4.4.1-1) ...
Setting up gcc (4:14.2.0-1) ...
Setting up dh-autoreconf (20) ...
Setting up python3-inflect (7.3.1-2) ...
Setting up python3-jaraco.text (4.0.0-1) ...
Setting up python3-dev (3.12.7-1) ...
Setting up g++ (4:14.2.0-1) ...
update-alternatives: using /usr/bin/g++ to provide /usr/bin/c++ (c++) in auto mode
Setting up build-essential (12.12) ...
Setting up python3-pkg-resources (75.2.0-1) ...
Setting up python3-setuptools (75.2.0-1) ...
Setting up debhelper (13.20) ...
Setting up python3-numpy (1:1.26.4+ds-12) ...
Setting up dh-python (6.20241024) ...
Setting up sbuild-build-depends-main-dummy (0.invalid.0) ...
Processing triggers for man-db (2.13.0-1) ...
Processing triggers for libc-bin (2.40-3) ...
+------------------------------------------------------------------------------+
| Check architectures |
+------------------------------------------------------------------------------+
Arch check ok (arm64 included in any)
+------------------------------------------------------------------------------+
| Build environment |
+------------------------------------------------------------------------------+
Kernel: Linux 6.1.0-27-cloud-arm64 #1 SMP Debian 6.1.115-1 (2024-11-01) arm64 (aarch64)
Toolchain package versions: binutils_2.43.1-5 dpkg-dev_1.22.12~1.gbp82cafd g++-14_14.2.0-8 gcc-14_14.2.0-8 libc6-dev_2.40-3 libstdc++-14-dev_14.2.0-8 libstdc++6_14.2.0-8 linux-libc-dev_6.11.7-1
Package versions: appstream_1.0.3-1+b1 apt_2.9.11 autoconf_2.72-3 automake_1:1.16.5-1.3 autopoint_0.22.5-2 autotools-dev_20220109.1 base-files_13.5 base-passwd_3.6.5 bash_5.2.32-1+b2 binutils_2.43.1-5 binutils-aarch64-linux-gnu_2.43.1-5 binutils-common_2.43.1-5 bsdextrautils_2.40.2-11 bsdutils_1:2.40.2-11 build-essential_12.12 bzip2_1.0.8-6 ca-certificates_20240203 chrpath_0.18-1 cmake_3.31.0-1 cmake-data_3.31.0-1 coreutils_9.5-1+b1 cpp_4:14.2.0-1 cpp-14_14.2.0-8 cpp-14-aarch64-linux-gnu_14.2.0-8 cpp-aarch64-linux-gnu_4:14.2.0-1 dash_0.5.12-9+b1 debconf_1.5.87 debhelper_13.20 debian-archive-keyring_2023.4 debianutils_5.20+b1 dh-autoreconf_20 dh-python_6.20241024 dh-strip-nondeterminism_1.14.0-1 diffstat_1.66-1+b1 diffutils_1:3.10-1+b1 dpkg_1.22.12~1.gbp82cafd dpkg-dev_1.22.12~1.gbp82cafd dwz_0.15-1+b1 e2fsprogs_1.47.1-1+b1 fakeroot_1.36-1 file_1:5.45-3+b1 findutils_4.10.0-3 flatbuffers-compiler_23.5.26+dfsg-1.1+b1 flatbuffers-compiler-dev_23.5.26+dfsg-1.1+b1 g++_4:14.2.0-1 g++-14_14.2.0-8 g++-14-aarch64-linux-gnu_14.2.0-8 g++-aarch64-linux-gnu_4:14.2.0-1 gcc_4:14.2.0-1 gcc-14_14.2.0-8 gcc-14-aarch64-linux-gnu_14.2.0-8 gcc-14-base_14.2.0-8 gcc-aarch64-linux-gnu_4:14.2.0-1 gettext_0.22.5-2 gettext-base_0.22.5-2 gpg_2.2.45-2 gpgconf_2.2.45-2 gpgv_2.2.45-2 grep_3.11-4+b1 groff-base_1.23.0-5 gzip_1.12-1.1+b1 hostname_3.25 icu-devtools_72.1-5+b1 init-system-helpers_1.67 intltool-debian_0.35.0+20060710.6 iso-codes_4.17.0-1 libacl1_2.3.2-2+b1 libaliased-perl_0.34-3 libappstream5_1.0.3-1+b1 libapt-pkg-perl_0.1.40+b6 libapt-pkg6.0t64_2.9.11 libarchive-zip-perl_1.68-1 libarchive13t64_3.7.4-1.1 libarm-compute-dev_23.08+dfsg-3.1 libarm-compute32t64_23.08+dfsg-3.1 libasan8_14.2.0-8 libassuan9_3.0.1-2 libatomic1_14.2.0-8 libattr1_1:2.5.2-2 libaudit-common_1:4.0.2-2 libaudit1_1:4.0.2-2 libb-hooks-endofscope-perl_0.28-1 libb-hooks-op-check-perl_0.22-3+b2 libberkeleydb-perl_0.66-1 libbinutils_2.43.1-5 libblas3_3.12.0-3+b1 libblkid1_2.40.2-11 libboost-atomic1.83-dev_1.83.0-3.2+b1 libboost-atomic1.83.0_1.83.0-3.2+b1 libboost-chrono1.83-dev_1.83.0-3.2+b1 libboost-chrono1.83.0t64_1.83.0-3.2+b1 libboost-date-time1.83-dev_1.83.0-3.2+b1 libboost-date-time1.83.0_1.83.0-3.2+b1 libboost-filesystem-dev_1.83.0.2+b2 libboost-filesystem1.83-dev_1.83.0-3.2+b1 libboost-filesystem1.83.0_1.83.0-3.2+b1 libboost-log-dev_1.83.0.2+b2 libboost-log1.83-dev_1.83.0-3.2+b1 libboost-log1.83.0_1.83.0-3.2+b1 libboost-program-options-dev_1.83.0.2+b2 libboost-program-options1.83-dev_1.83.0-3.2+b1 libboost-program-options1.83.0_1.83.0-3.2+b1 libboost-regex1.83-dev_1.83.0-3.2+b1 libboost-regex1.83.0_1.83.0-3.2+b1 libboost-serialization1.83-dev_1.83.0-3.2+b1 libboost-serialization1.83.0_1.83.0-3.2+b1 libboost-system-dev_1.83.0.2+b2 libboost-system1.83-dev_1.83.0-3.2+b1 libboost-system1.83.0_1.83.0-3.2+b1 libboost-test-dev_1.83.0.2+b2 libboost-test1.83-dev_1.83.0-3.2+b1 libboost-test1.83.0_1.83.0-3.2+b1 libboost-thread1.83-dev_1.83.0-3.2+b1 libboost-thread1.83.0_1.83.0-3.2+b1 libboost1.83-dev_1.83.0-3.2+b1 libbrotli1_1.1.0-2+b6 libbsd0_0.12.2-2 libbz2-1.0_1.0.8-6 libc-bin_2.40-3 libc-dev-bin_2.40-3 libc6_2.40-3 libc6-dbg_2.40-3 libc6-dev_2.40-3 libcap-ng0_0.8.5-3+b1 libcap2_1:2.66-5+b1 libcapture-tiny-perl_0.48-2 libcc1-0_14.2.0-8 libcgi-pm-perl_4.66-1 libclass-data-inheritable-perl_0.10-1 libclass-inspector-perl_1.36-3 libclass-method-modifiers-perl_2.15-1 libclass-xsaccessor-perl_1.19-4+b4 libclone-perl_0.47-1+b1 libcom-err2_1.47.1-1+b1 libconfig-tiny-perl_2.30-1 libconst-fast-perl_0.014-2 libcpanel-json-xs-perl_4.38-1+b1 libcrypt-dev_1:4.4.36-5 libcrypt1_1:4.4.36-5 libctf-nobfd0_2.43.1-5 libctf0_2.43.1-5 libcurl3t64-gnutls_8.11.0-1 libcurl4t64_8.11.0-1 libdata-dpath-perl_0.60-1 libdata-messagepack-perl_1.02-1+b4 libdata-optlist-perl_0.114-1 libdata-validate-domain-perl_0.15-1 libdata-validate-ip-perl_0.31-1 libdata-validate-uri-perl_0.07-3 libdb5.3t64_5.3.28+dfsg2-9 libdebconfclient0_0.273 libdebhelper-perl_13.20 libdevel-callchecker-perl_0.009-1+b1 libdevel-size-perl_0.84-1+b1 libdevel-stacktrace-perl_2.0500-1 libdpkg-perl_1.22.12~1.gbp82cafd libdynaloader-functions-perl_0.004-1 libelf1t64_0.192-4 libemail-address-xs-perl_1.05-1+b4 libencode-locale-perl_1.05-3 libexception-class-perl_1.45-1 libexpat1_2.6.4-1 libexpat1-dev_2.6.4-1 libext2fs2t64_1.47.1-1+b1 libfakeroot_1.36-1 libffi8_3.4.6-1 libfile-basedir-perl_0.09-2 libfile-find-rule-perl_0.34-3 libfile-listing-perl_6.16-1 libfile-sharedir-perl_1.118-3 libfile-stripnondeterminism-perl_1.14.0-1 libflatbuffers-dev_23.5.26+dfsg-1.1+b1 libflatbuffers23.5.26_23.5.26+dfsg-1.1+b1 libfont-ttf-perl_1.06-2 libgcc-14-dev_14.2.0-8 libgcc-s1_14.2.0-8 libgcrypt20_1.11.0-6 libgdbm-compat4t64_1.24-2 libgdbm6t64_1.24-2 libgfortran5_14.2.0-8 libglib2.0-0t64_2.82.2-3 libgmp10_2:6.3.0+dfsg-2+b2 libgnutls30t64_3.8.8-2 libgomp1_14.2.0-8 libgpg-error0_1.50-4 libgprofng0_2.43.1-5 libgssapi-krb5-2_1.21.3-3 libhogweed6t64_3.10-1+b1 libhtml-form-perl_6.12-1 libhtml-html5-entities-perl_0.004-3 libhtml-parser-perl_3.83-1+b1 libhtml-tagset-perl_3.24-1 libhtml-tokeparser-simple-perl_3.16-4 libhtml-tree-perl_5.07-3 libhttp-cookies-perl_6.11-1 libhttp-date-perl_6.06-1 libhttp-message-perl_7.00-2 libhttp-negotiate-perl_6.01-2 libhwasan0_14.2.0-8 libicu-dev_72.1-5+b1 libicu72_72.1-5+b1 libidn2-0_2.3.7-2+b1 libimport-into-perl_1.002005-2 libio-html-perl_1.004-3 libio-interactive-perl_1.025-1 libio-socket-ssl-perl_2.089-1 libio-string-perl_1.08-4 libipc-run3-perl_0.049-1 libipc-system-simple-perl_1.30-2 libisl23_0.27-1 libiterator-perl_0.03+ds1-2 libiterator-util-perl_0.02+ds1-2 libitm1_14.2.0-8 libjansson4_2.14-2+b3 libjs-jquery_3.6.1+dfsg+~3.5.14-1 libjs-sphinxdoc_7.4.7-4 libjs-underscore_1.13.4~dfsg+~1.11.4-3 libjson-maybexs-perl_1.004008-1 libjsoncpp26_1.9.6-2 libk5crypto3_1.21.3-3 libkeyutils1_1.6.3-4 libkrb5-3_1.21.3-3 libkrb5support0_1.21.3-3 liblapack3_3.12.0-3+b1 libldap-2.5-0_2.5.18+dfsg-3+b1 liblist-compare-perl_0.55-2 liblist-someutils-perl_0.59-1 liblist-utilsby-perl_0.12-2 liblsan0_14.2.0-8 liblwp-mediatypes-perl_6.04-2 liblwp-protocol-https-perl_6.14-1 liblz1_1.15~pre2-1 liblz4-1_1.9.4-3+b1 liblzma5_5.6.3-1+b1 liblzo2-2_2.10-3+b1 libmagic-mgc_1:5.45-3+b1 libmagic1t64_1:5.45-3+b1 libmarkdown2_2.2.7-2+b1 libmd0_1.1.0-2+b1 libmldbm-perl_2.05-4 libmodule-implementation-perl_0.09-2 libmodule-runtime-perl_0.016-2 libmoo-perl_2.005005-1 libmoox-aliases-perl_0.001006-2 libmount1_2.40.2-11 libmouse-perl_2.5.11-1+b1 libmpc3_1.3.1-1+b3 libmpfr6_4.2.1-1+b2 libnamespace-clean-perl_0.27-2 libncursesw6_6.5-2+b1 libnet-domain-tld-perl_1.75-4 libnet-http-perl_6.23-1 libnet-ipv6addr-perl_1.02-1 libnet-netmask-perl_2.0002-2 libnet-ssleay-perl_1.94-2 libnetaddr-ip-perl_4.079+dfsg-2+b4 libnettle8t64_3.10-1+b1 libnghttp2-14_1.64.0-1 libnghttp3-9_1.4.0-1+b1 libngtcp2-16_1.6.0-1 libngtcp2-crypto-gnutls8_1.6.0-1 libnsl2_1.3.0-3+b3 libnumber-compare-perl_0.03-3 libp11-kit0_0.25.5-2+b1 libpackage-stash-perl_0.40-1 libpam-modules_1.5.3-7+b1 libpam-modules-bin_1.5.3-7+b1 libpam-runtime_1.5.3-7 libpam0g_1.5.3-7+b1 libparams-classify-perl_0.015-2+b4 libparams-util-perl_1.102-3+b1 libpath-tiny-perl_0.146-1 libpcre2-8-0_10.44-2 libperl5.40_5.40.0-7 libperlio-gzip-perl_0.20-1+b4 libperlio-utf8-strict-perl_0.010-1+b3 libpipeline1_1.5.8-1 libproc-processtable-perl_0.636-1+b3 libproc2-0_2:4.0.4-6 libpsl5t64_0.21.2-1.1+b1 libpython3-dev_3.12.7-1 libpython3-stdlib_3.12.7-1 libpython3.12-dev_3.12.7-3 libpython3.12-minimal_3.12.7-3 libpython3.12-stdlib_3.12.7-3 libpython3.12t64_3.12.7-3 libreadline8t64_8.2-5 libregexp-wildcards-perl_1.05-3 librhash1_1.4.5-1 librole-tiny-perl_2.002004-1 librtmp1_2.4+20151223.gitfa8646d.1-2+b5 libsasl2-2_2.1.28+dfsg1-8 libsasl2-modules-db_2.1.28+dfsg1-8 libseccomp2_2.5.5-1+b3 libselinux1_3.7-3+b1 libsemanage-common_3.7-2 libsemanage2_3.7-2+b1 libsepol2_3.7-1 libsereal-decoder-perl_5.004+ds-1+b3 libsereal-encoder-perl_5.004+ds-1+b3 libsframe1_2.43.1-5 libsmartcols1_2.40.2-11 libsort-versions-perl_1.62-3 libsqlite3-0_3.46.1-1 libss2_1.47.1-1+b1 libssh2-1t64_1.11.1-1 libssl3t64_3.3.2-2 libstdc++-14-dev_14.2.0-8 libstdc++6_14.2.0-8 libstemmer0d_2.2.0-4+b2 libstrictures-perl_2.000006-1 libsub-exporter-perl_0.990-1 libsub-exporter-progressive-perl_0.001013-3 libsub-identify-perl_0.14-3+b3 libsub-install-perl_0.929-1 libsub-name-perl_0.27-1+b3 libsub-quote-perl_2.006008-1 libsyntax-keyword-try-perl_0.30-1+b1 libsystemd0_257~rc1-4 libtasn1-6_4.19.0-3+b3 libterm-readkey-perl_2.38-2+b4 libtext-glob-perl_0.11-3 libtext-levenshteinxs-perl_0.03-5+b4 libtext-markdown-discount-perl_0.16-1+b3 libtext-xslate-perl_3.5.9-2+b1 libtime-duration-perl_1.21-2 libtime-moment-perl_0.44-2+b4 libtimedate-perl_2.3300-2 libtinfo6_6.5-2+b1 libtirpc-common_1.3.4+ds-1.3 libtirpc3t64_1.3.4+ds-1.3+b1 libtool_2.4.7-8 libtry-tiny-perl_0.32-1 libtsan2_14.2.0-8 libubsan1_14.2.0-8 libuchardet0_0.0.8-1+b2 libudev1_257~rc1-4 libunicode-utf8-perl_0.62-2+b3 libunistring5_1.2-1+b1 liburi-perl_5.30-1 libuuid1_2.40.2-11 libuv1t64_1.48.0-7 libvariable-magic-perl_0.64-1+b1 libwww-mechanize-perl_2.19-1 libwww-perl_6.77-1 libwww-robotrules-perl_6.02-1 libxml-libxml-perl_2.0207+dfsg+really+2.0134-5+b1 libxml-namespacesupport-perl_1.12-2 libxml-sax-base-perl_1.09-3 libxml-sax-perl_1.02+dfsg-3 libxml2_2.12.7+dfsg+really2.9.14-0.2+b1 libxmlb2_0.3.21-1 libxs-parse-keyword-perl_0.46-1+b1 libxxhash0_0.8.2-2+b2 libyaml-0-2_0.2.5-1+b2 libyaml-libyaml-perl_0.902.0+ds-2+b1 libzstd1_1.5.6+dfsg-1+b1 lintian_2.120.0 linux-libc-dev_6.11.7-1 login_1:4.16.0-2+really2.40.2-11 login.defs_1:4.16.0-4 logsave_1.47.1-1+b1 lzop_1.04-2+b1 m4_1.4.19-4 make_4.3-4.1+b1 man-db_2.13.0-1 mawk_1.3.4.20240905-1 media-types_10.1.0 mount_2.40.2-11 ncurses-base_6.5-2 ncurses-bin_6.5-2+b1 netbase_6.4 openssl_3.3.2-2 openssl-provider-legacy_3.3.2-2 passwd_1:4.16.0-4 patch_2.7.6-7+b1 patchutils_0.4.2-1+b1 perl_5.40.0-7 perl-base_5.40.0-7 perl-modules-5.40_5.40.0-7 perl-openssl-defaults_7+b2 plzip_1.11-2 po-debconf_1.0.21+nmu1 procps_2:4.0.4-6 python3_3.12.7-1 python3-autocommand_2.2.2-3 python3-dev_3.12.7-1 python3-inflect_7.3.1-2 python3-jaraco.context_6.0.0-1 python3-jaraco.functools_4.1.0-1 python3-jaraco.text_4.0.0-1 python3-minimal_3.12.7-1 python3-more-itertools_10.5.0-1 python3-numpy_1:1.26.4+ds-12 python3-pkg-resources_75.2.0-1 python3-setuptools_75.2.0-1 python3-typeguard_4.4.1-1 python3-typing-extensions_4.12.2-2 python3-zipp_3.21.0-1 python3.12_3.12.7-3 python3.12-dev_3.12.7-3 python3.12-minimal_3.12.7-3 readline-common_8.2-5 rpcsvc-proto_1.4.3-1+b1 sbuild-build-depends-main-dummy_0.invalid.0 sed_4.9-2+b1 sensible-utils_0.0.24 shared-mime-info_2.4-5+b1 swig_4.2.1-1+b1 sysvinit-utils_3.11-1 t1utils_1.41-4+b1 tar_1.35+dfsg-3+b1 tzdata_2024b-3 ucf_3.0043+nmu1 unzip_6.0-28+b1 util-linux_2.40.2-11 valgrind_1:3.20.0-2.1 xxd_2:9.1.0861-1 xz-utils_5.6.3-1+b1 zlib1g_1:1.3.dfsg+really1.3.1-1+b1 zlib1g-dev_1:1.3.dfsg+really1.3.1-1+b1
+------------------------------------------------------------------------------+
| Build |
+------------------------------------------------------------------------------+
Unpack source
-------------
-----BEGIN PGP SIGNED MESSAGE-----
Hash: SHA512
Format: 3.0 (quilt)
Source: armnn
Binary: libarmnn33t64, libarmnn-dev, libarmnntfliteparser24t64, libarmnntfliteparser-dev, python3-pyarmnn, libarmnn-cpuacc-backend33, libarmnnaclcommon33t64, libarmnn-cpuref-backend33, libarmnn-gpuacc-backend33, armnn-latest-cpu, armnn-latest-gpu, armnn-latest-cpu-gpu, armnn-latest-cpu-gpu-ref, armnn-latest-ref, armnn-latest-all
Architecture: any
Version: 23.08-4.1
Maintainer: Francis Murtagh <francis.murtagh@arm.com>
Uploaders: Wookey <wookey@debian.org>, Emanuele Rocca <ema@debian.org>
Standards-Version: 4.6.2
Vcs-Browser: https://salsa.debian.org/deeplearning-team/armnn
Vcs-Git: https://salsa.debian.org/deeplearning-team/armnn.git
Testsuite: autopkgtest
Testsuite-Triggers: g++
Build-Depends: dpkg-dev (>= 1.22.5), libboost-test-dev (>= 1.64), libboost-system-dev (>= 1.64), libboost-filesystem-dev (>= 1.64), libboost-log-dev (>= 1.64), libboost-program-options-dev (>= 1.64), cmake, debhelper-compat (= 12), valgrind, libflatbuffers-dev, libarm-compute-dev [amd64 arm64 armhf], swig (>= 4.0.1-5), dh-python, python3-setuptools, libpython3-dev, python3-dev:any, python3-numpy:native, xxd, flatbuffers-compiler, chrpath
Package-List:
armnn-latest-all deb devel optional arch=any
armnn-latest-cpu deb devel optional arch=arm64
armnn-latest-cpu-gpu deb devel optional arch=arm64
armnn-latest-cpu-gpu-ref deb devel optional arch=arm64
armnn-latest-gpu deb devel optional arch=armhf,arm64
armnn-latest-ref deb devel optional arch=any
libarmnn-cpuacc-backend33 deb devel optional arch=arm64
libarmnn-cpuref-backend33 deb devel optional arch=any
libarmnn-dev deb devel optional arch=any
libarmnn-gpuacc-backend33 deb devel optional arch=armhf,arm64
libarmnn33t64 deb devel optional arch=any
libarmnnaclcommon33t64 deb devel optional arch=armhf,arm64
libarmnntfliteparser-dev deb devel optional arch=any
libarmnntfliteparser24t64 deb devel optional arch=any
python3-pyarmnn deb devel optional arch=any
Checksums-Sha1:
39648b89979253c9713fe7f2d7f107eaec141ddc 27253600 armnn_23.08.orig.tar.xz
452aae7950e4a4f5cf9ee77475f2cb97579981ab 30216 armnn_23.08-4.1.debian.tar.xz
Checksums-Sha256:
d5a0c4b3c39e201c7409e8b85c50e5e3b3850fd403db6aac26cbc85bce243a2e 27253600 armnn_23.08.orig.tar.xz
065ce8a054be85851f9c7312de683d2f7ceda9b05adbe63dd808f46a20b87a0b 30216 armnn_23.08-4.1.debian.tar.xz
Files:
a8926bdd953bbae74c94c5f8388e12ea 27253600 armnn_23.08.orig.tar.xz
6962fd59387288e2b8bf76a565547825 30216 armnn_23.08-4.1.debian.tar.xz
-----BEGIN PGP SIGNATURE-----
iQJGBAEBCgAwFiEErEg/aN5yj0PyIC/KVo0w8yGyEz0FAmXekCISHHZvcmxvbkBk
ZWJpYW4ub3JnAAoJEFaNMPMhshM9H1wP/2GvzH57g84lEG251Kf0MqzXH6AF0RnI
78Co4yMEP8JZr+EyuHzlYlP+LAx7bLc6DWMPEbivjMVft0GHbVzWsn2+EOMTofvA
BdvZyvix2pgZKR3kDB3ZFI6z/KeCTSln+YYtHhFpBJ16eLd+Vf6Hho5pZwi2EsgX
NWqVAGZauebazOI0ToB/H3T+4jRJQX8Izx9x0uvEj73au7Tb+9QGLBoYBLlCz5YF
6Aw52E/k+eRoS0MYildNF9qubhSysg4F36rYGmKH1TDv7A/2tx/eMFN2Y0KHd89a
o9hcTJGG3T4DCON/x/63EyeV5dKaTmHJmA5qc7EecGEEGU84EBMoJSU1U1vnBDp9
dm7rSroQKESKdHCL/oA4yoKl5SfRAVHh7z1crTxuivzzw/AUHBwsI/I9Fb45LzxM
wz+ZwPT0jAk1DxARGV2bxeWVWh1I259UeQFNPbEqvrqs961gvQIDnd94F+HyIPND
v/NHsLFqh4n19I882E1eGHP/qYyaAt7k7W+FvOKUI8sE7grSs2gpZF+OBp6gTDfD
kgn+0Ere0Kqpd+iBGUJsB9ALxfbZWGb11PdtBVu8eZW+QdV+gM7fxAnjEvwkz56p
Jw2V4m8ubBc1/spKvrTRNh8FTis1Gu+BI69bHSe7iFB7U0/zWs27DZfi114isu6j
haTiF8lXoYGZ
=tnUH
-----END PGP SIGNATURE-----
gpgv: Signature made Wed Feb 28 01:45:06 2024 UTC
gpgv: using RSA key AC483F68DE728F43F2202FCA568D30F321B2133D
gpgv: issuer "vorlon@debian.org"
gpgv: Can't check signature: No public key
dpkg-source: warning: cannot verify inline signature for ./armnn_23.08-4.1.dsc: no acceptable signature found
dpkg-source: info: extracting armnn in /<<PKGBUILDDIR>>
dpkg-source: info: unpacking armnn_23.08.orig.tar.xz
dpkg-source: info: unpacking armnn_23.08-4.1.debian.tar.xz
dpkg-source: info: using patch list from debian/patches/series
dpkg-source: info: applying ignore-gcc9-warning
dpkg-source: info: applying use-system-libarm-compute-library
dpkg-source: info: applying use-pkgconfig-for-arm-compute-libraries
dpkg-source: info: applying fix-logic-so-opencl-is-not-linked-if-ope
dpkg-source: info: applying unset-opencl_libraries-so-it-doesnt-get-
dpkg-source: info: applying 0006-Add-tensorflow-files.patch
dpkg-source: info: applying link-against-libflatbuffers.so-rather-th
dpkg-source: info: applying allow-installation-via-make-install.patch
dpkg-source: info: applying allow-use-of-system-opencl-includes
dpkg-source: info: applying split-out-backends-to-dynamically-loadab
dpkg-source: info: applying fix-gcc13-ftbfs.patch
dpkg-source: info: applying 0012-Add-profiling-includes.patch
dpkg-source: info: applying 0013-setup.py-avoid-importing-the-cross-built-_pyarmnn_ve.patch
Check disk space
----------------
Sufficient free space for build
User Environment
----------------
APT_CONFIG=/var/lib/sbuild/apt.conf
HOME=/sbuild-nonexistent
LANG=en_US.UTF-8
LC_ALL=C.UTF-8
LOGNAME=debusine-worker
PATH=/usr/local/sbin:/usr/local/bin:/usr/sbin:/usr/bin:/sbin:/bin:/usr/games
SHELL=/bin/sh
USER=debusine-worker
dpkg-buildpackage
-----------------
Command: dpkg-buildpackage -us -uc -b -rfakeroot
dpkg-buildpackage: info: source package armnn
dpkg-buildpackage: info: source version 23.08-4.1
dpkg-buildpackage: info: source distribution unstable
dpkg-buildpackage: info: source changed by Steve Langasek <vorlon@debian.org>
dpkg-source --before-build .
dpkg-buildpackage: info: host architecture arm64
debian/rules clean
dh clean --with python3 --buildsystem=cmake --builddirectory=build-area
dh_auto_clean -O--buildsystem=cmake -O--builddirectory=build-area
dh_autoreconf_clean -O--buildsystem=cmake -O--builddirectory=build-area
dh_clean -O--buildsystem=cmake -O--builddirectory=build-area
rm -f debian/debhelper-build-stamp
rm -rf debian/.debhelper/
rm -f -- debian/libarmnn33t64.substvars debian/libarmnn-dev.substvars debian/libarmnntfliteparser24t64.substvars debian/libarmnntfliteparser-dev.substvars debian/python3-pyarmnn.substvars debian/libarmnn-cpuacc-backend33.substvars debian/libarmnnaclcommon33t64.substvars debian/libarmnn-cpuref-backend33.substvars debian/libarmnn-gpuacc-backend33.substvars debian/armnn-latest-cpu.substvars debian/armnn-latest-gpu.substvars debian/armnn-latest-cpu-gpu.substvars debian/armnn-latest-cpu-gpu-ref.substvars debian/armnn-latest-ref.substvars debian/armnn-latest-all.substvars debian/files
rm -fr -- debian/libarmnn33t64/ debian/tmp/ debian/libarmnn-dev/ debian/libarmnntfliteparser24t64/ debian/libarmnntfliteparser-dev/ debian/python3-pyarmnn/ debian/libarmnn-cpuacc-backend33/ debian/libarmnnaclcommon33t64/ debian/libarmnn-cpuref-backend33/ debian/libarmnn-gpuacc-backend33/ debian/armnn-latest-cpu/ debian/armnn-latest-gpu/ debian/armnn-latest-cpu-gpu/ debian/armnn-latest-cpu-gpu-ref/ debian/armnn-latest-ref/ debian/armnn-latest-all/
find . \( \( \
\( -path .\*/.git -o -path .\*/.svn -o -path .\*/.bzr -o -path .\*/.hg -o -path .\*/CVS -o -path .\*/.pc -o -path .\*/_darcs \) -prune -o -type f -a \
\( -name '#*#' -o -name '.*~' -o -name '*~' -o -name DEADJOE \
-o -name '*.orig' -o -name '*.rej' -o -name '*.bak' \
-o -name '.*.orig' -o -name .*.rej -o -name '.SUMS' \
-o -name TAGS -o \( -path '*/.deps/*' -a -name '*.P' \) \
\) -exec rm -f {} + \) -o \
\( -type d -a \( -name autom4te.cache -o -name __pycache__ \) -prune -exec rm -rf {} + \) \)
debian/rules binary
dh binary --with python3 --buildsystem=cmake --builddirectory=build-area
dh_update_autotools_config -O--buildsystem=cmake -O--builddirectory=build-area
dh_autoreconf -O--buildsystem=cmake -O--builddirectory=build-area
debian/rules override_dh_auto_configure
make[1]: Entering directory '/<<PKGBUILDDIR>>'
flatc -c --gen-object-api --reflect-types --reflect-names -o /<<PKGBUILDDIR>>/third-party/tensorflow/lite/schema/ /<<PKGBUILDDIR>>/third-party/tensorflow/lite/schema/schema.fbs
dh_auto_configure -- -DARMCOMPUTENEON=1 -DARMCOMPUTECL=1 -DARMCOMPUTE_LIBRARIES='arm_compute' -DBUILD_TESTS=1 \
-DSHARED_BOOST=ON \
-DARMNNREF=0 \
-DBUILD_ARMNN_SERIALIZER=1 \
-DBUILD_TF_LITE_PARSER=1 \
-DTENSORFLOW_ROOT=/<<PKGBUILDDIR>>/third-party/ \
-DTF_LITE_SCHEMA_INCLUDE_PATH=/<<PKGBUILDDIR>>/third-party/tensorflow/lite/schema/ \
-DTF_LITE_GENERATED_PATH=/<<PKGBUILDDIR>>/third-party/tensorflow \
-DPYTHON_INCLUDE_DIR=/usr/include/python3.12 \
-DPYTHON_LIBRARY=/usr/lib/aarch64-linux-gnu \
-DBUILD_PYTHON_SRC=ON \
-DSWIG_EXECUTABLE=/usr/bin/swig \
-DBUILD_GATORD_MOCK=0 \
-DDYNAMIC_BACKEND_PATHS='/usr/lib/aarch64-linux-gnu/armnn33/'
cd build-area && DEB_PYTHON_INSTALL_LAYOUT=deb PKG_CONFIG=/usr/bin/pkg-config cmake -DCMAKE_INSTALL_PREFIX=/usr -DCMAKE_BUILD_TYPE=None -DCMAKE_INSTALL_SYSCONFDIR=/etc -DCMAKE_INSTALL_LOCALSTATEDIR=/var -DCMAKE_EXPORT_NO_PACKAGE_REGISTRY=ON -DCMAKE_FIND_USE_PACKAGE_REGISTRY=OFF -DCMAKE_FIND_PACKAGE_NO_PACKAGE_REGISTRY=ON -DFETCHCONTENT_FULLY_DISCONNECTED=ON -DCMAKE_INSTALL_RUNSTATEDIR=/run "-GUnix Makefiles" -DCMAKE_VERBOSE_MAKEFILE=ON -DCMAKE_INSTALL_LIBDIR=lib/aarch64-linux-gnu -DARMCOMPUTENEON=1 -DARMCOMPUTECL=1 -DARMCOMPUTE_LIBRARIES=arm_compute -DBUILD_TESTS=1 -DSHARED_BOOST=ON -DARMNNREF=0 -DBUILD_ARMNN_SERIALIZER=1 -DBUILD_TF_LITE_PARSER=1 -DTENSORFLOW_ROOT=/<<PKGBUILDDIR>>/third-party/ -DTF_LITE_SCHEMA_INCLUDE_PATH=/<<PKGBUILDDIR>>/third-party/tensorflow/lite/schema/ -DTF_LITE_GENERATED_PATH=/<<PKGBUILDDIR>>/third-party/tensorflow -DPYTHON_INCLUDE_DIR=/usr/include/python3.12 -DPYTHON_LIBRARY=/usr/lib/aarch64-linux-gnu -DBUILD_PYTHON_SRC=ON -DSWIG_EXECUTABLE=/usr/bin/swig -DBUILD_GATORD_MOCK=0 -DDYNAMIC_BACKEND_PATHS=/usr/lib/aarch64-linux-gnu/armnn33/ ..
CMake Deprecation Warning at CMakeLists.txt:6 (cmake_minimum_required):
Compatibility with CMake < 3.10 will be removed from a future version of
CMake.
Update the VERSION argument <min> value or use a ...<max> suffix to tell
CMake that the project does not need compatibility with older versions.
-- The C compiler identification is GNU 14.2.0
-- The CXX compiler identification is GNU 14.2.0
-- Detecting C compiler ABI info
-- Detecting C compiler ABI info - done
-- Check for working C compiler: /usr/bin/cc - skipped
-- Detecting C compile features
-- Detecting C compile features - done
-- Detecting CXX compiler ABI info
-- Detecting CXX compiler ABI info - done
-- Check for working CXX compiler: /usr/bin/c++ - skipped
-- Detecting CXX compile features
-- Detecting CXX compile features - done
-- Could NOT find PkgConfig (missing: PKG_CONFIG_EXECUTABLE)
-- Performing Test CMAKE_HAVE_LIBC_PTHREAD
-- Performing Test CMAKE_HAVE_LIBC_PTHREAD - Success
-- Found Threads: TRUE
-- Flatbuffers headers are located at: /usr/include
-- Flatbuffers library located at: /usr/lib/aarch64-linux-gnu/libflatbuffers.so
-- Tf Lite generated header found at: /<<PKGBUILDDIR>>/third-party/tensorflow/lite/schema
-- Flatbuffers headers are located at: /usr/include
-- Flatbuffers library located at: /usr/lib/aarch64-linux-gnu/libflatbuffers.so
-- Looking for include file valgrind/memcheck.h
-- Looking for include file valgrind/memcheck.h - found
-- PyArmNN wheel package is disabled
CMake Warning (dev) at cmake/GlobalConfig.cmake:515 (find_package):
Policy CMP0148 is not set: The FindPythonInterp and FindPythonLibs modules
are removed. Run "cmake --help-policy CMP0148" for policy details. Use
the cmake_policy command to set the policy and suppress this warning.
Call Stack (most recent call first):
CMakeLists.txt:25 (include)
This warning is for project developers. Use -Wno-dev to suppress it.
-- Found PythonInterp: /usr/bin/python3 (found suitable version "3.12.7", minimum required is "3")
CMake Warning (dev) at cmake/GlobalConfig.cmake:520 (find_package):
Policy CMP0148 is not set: The FindPythonInterp and FindPythonLibs modules
are removed. Run "cmake --help-policy CMP0148" for policy details. Use
the cmake_policy command to set the policy and suppress this warning.
Call Stack (most recent call first):
CMakeLists.txt:25 (include)
This warning is for project developers. Use -Wno-dev to suppress it.
-- Found PythonLibs: /usr/lib/aarch64-linux-gnu (found suitable version "3.12.7", minimum required is "3")
-- Found SWIG: /usr/bin/swig (found suitable version "4.2.1", minimum required is "4")
-- TENSORFLOW_ROOT: /<<PKGBUILDDIR>>/third-party/
-- Found TfLiteSrc: /<<PKGBUILDDIR>>/third-party
Using flatc was from: /usr/bin/flatc
-- Including backend common library into the build: /<<PKGBUILDDIR>>/src/backends/aclCommon/common.cmake
-- Including backend common library into the build: /<<PKGBUILDDIR>>/src/backends/backendsCommon/common.cmake
-- Including backend common library into the build: /<<PKGBUILDDIR>>/src/backends/tosaCommon/common.cmake
-- Including backend into the build: /<<PKGBUILDDIR>>/src/backends/cl/backend.cmake
CMake Warning (dev) at src/backends/cl/CMakeLists.txt:67:
Syntax Warning in cmake code at column 58
Argument not separated from preceding token by whitespace.
This warning is for project developers. Use -Wno-dev to suppress it.
# Link OpenCl libraries to GpuAcc backend:
-- Including backend into the build: /<<PKGBUILDDIR>>/src/backends/neon/backend.cmake
-- Including backend into the build: /<<PKGBUILDDIR>>/src/backends/reference/backend.cmake
-- Reference backend is disabled
-- Including backend into the build: /<<PKGBUILDDIR>>/src/backends/tosaReference/backend.cmake
-- TOSA Reference backend is disabled
-- Adding object library dependency to armnn: armnnBackendsCommon
-- Adding object library dependency to armnn: armnnMemoryOptimizationStrategies
-- Adding object library dependency to armnn: armnnTosaRefBackend
-- Linker will generate mapfile
-- Adding object library dependency to UnitTests: armnnMemoryOptimizationStrategiesUnitTests
-- CMAKE_CURRENT_LIST_DIR /<<PKGBUILDDIR>>
-- CMAKE_CURRENT_BINARY_DIR /<<PKGBUILDDIR>>/build-area
CMake Warning at python/pyarmnn/CMakeLists.txt:12 (message):
PyArmNN is deprecated. To use ArmNN on python, please use the tflite
delegate. Expected to be removed in release 24.05.
-- Configuring done (1.7s)
-- Generating done (0.2s)
CMake Warning:
Manually-specified variables were not used by the project:
CMAKE_EXPORT_NO_PACKAGE_REGISTRY
CMAKE_FIND_PACKAGE_NO_PACKAGE_REGISTRY
FETCHCONTENT_FULLY_DISCONNECTED
SHARED_BOOST
-- Build files have been written to: /<<PKGBUILDDIR>>/build-area
make[1]: Leaving directory '/<<PKGBUILDDIR>>'
dh_auto_build -O--buildsystem=cmake -O--builddirectory=build-area
cd build-area && make -j8 "INSTALL=install --strip-program=true" VERBOSE=1
make[1]: Entering directory '/<<PKGBUILDDIR>>/build-area'
/usr/bin/cmake -S/<<PKGBUILDDIR>> -B/<<PKGBUILDDIR>>/build-area --check-build-system CMakeFiles/Makefile.cmake 0
/usr/bin/cmake -E cmake_progress_start /<<PKGBUILDDIR>>/build-area/CMakeFiles /<<PKGBUILDDIR>>/build-area//CMakeFiles/progress.marks
make -f CMakeFiles/Makefile2 all
make[2]: Entering directory '/<<PKGBUILDDIR>>/build-area'
make -f CMakeFiles/armnnUtils.dir/build.make CMakeFiles/armnnUtils.dir/depend
make -f third-party/fmt/CMakeFiles/fmt.dir/build.make third-party/fmt/CMakeFiles/fmt.dir/depend
make -f src/backends/backendsCommon/CMakeFiles/armnnBackendsCommon.dir/build.make src/backends/backendsCommon/CMakeFiles/armnnBackendsCommon.dir/depend
make -f src/backends/backendsCommon/memoryOptimizerStrategyLibrary/CMakeFiles/armnnMemoryOptimizationStrategies.dir/build.make src/backends/backendsCommon/memoryOptimizerStrategyLibrary/CMakeFiles/armnnMemoryOptimizationStrategies.dir/depend
make -f src/backends/backendsCommon/memoryOptimizerStrategyLibrary/test/CMakeFiles/armnnMemoryOptimizationStrategiesUnitTests.dir/build.make src/backends/backendsCommon/memoryOptimizerStrategyLibrary/test/CMakeFiles/armnnMemoryOptimizationStrategiesUnitTests.dir/depend
make -f src/armnnSerializer/CMakeFiles/armnnSerializer-static.dir/build.make src/armnnSerializer/CMakeFiles/armnnSerializer-static.dir/depend
make -f tests/CMakeFiles/inferenceTest.dir/build.make tests/CMakeFiles/inferenceTest.dir/depend
make[3]: Entering directory '/<<PKGBUILDDIR>>/build-area'
cd /<<PKGBUILDDIR>>/build-area && /usr/bin/cmake -E cmake_depends "Unix Makefiles" /<<PKGBUILDDIR>> /<<PKGBUILDDIR>>/third-party/fmt /<<PKGBUILDDIR>>/build-area /<<PKGBUILDDIR>>/build-area/third-party/fmt /<<PKGBUILDDIR>>/build-area/third-party/fmt/CMakeFiles/fmt.dir/DependInfo.cmake "--color="
make -f src/backends/aclCommon/CMakeFiles/armnnAclCommon.dir/build.make src/backends/aclCommon/CMakeFiles/armnnAclCommon.dir/depend
make[3]: Entering directory '/<<PKGBUILDDIR>>/build-area'
cd /<<PKGBUILDDIR>>/build-area && /usr/bin/cmake -E cmake_depends "Unix Makefiles" /<<PKGBUILDDIR>> /<<PKGBUILDDIR>> /<<PKGBUILDDIR>>/build-area /<<PKGBUILDDIR>>/build-area /<<PKGBUILDDIR>>/build-area/CMakeFiles/armnnUtils.dir/DependInfo.cmake "--color="
make[3]: Entering directory '/<<PKGBUILDDIR>>/build-area'
cd /<<PKGBUILDDIR>>/build-area && /usr/bin/cmake -E cmake_depends "Unix Makefiles" /<<PKGBUILDDIR>> /<<PKGBUILDDIR>>/src/backends/backendsCommon/memoryOptimizerStrategyLibrary /<<PKGBUILDDIR>>/build-area /<<PKGBUILDDIR>>/build-area/src/backends/backendsCommon/memoryOptimizerStrategyLibrary /<<PKGBUILDDIR>>/build-area/src/backends/backendsCommon/memoryOptimizerStrategyLibrary/CMakeFiles/armnnMemoryOptimizationStrategies.dir/DependInfo.cmake "--color="
make[3]: Entering directory '/<<PKGBUILDDIR>>/build-area'
cd /<<PKGBUILDDIR>>/build-area && /usr/bin/cmake -E cmake_depends "Unix Makefiles" /<<PKGBUILDDIR>> /<<PKGBUILDDIR>>/src/backends/backendsCommon /<<PKGBUILDDIR>>/build-area /<<PKGBUILDDIR>>/build-area/src/backends/backendsCommon /<<PKGBUILDDIR>>/build-area/src/backends/backendsCommon/CMakeFiles/armnnBackendsCommon.dir/DependInfo.cmake "--color="
make[3]: Entering directory '/<<PKGBUILDDIR>>/build-area'
cd /<<PKGBUILDDIR>>/build-area && /usr/bin/cmake -E cmake_depends "Unix Makefiles" /<<PKGBUILDDIR>> /<<PKGBUILDDIR>>/src/backends/backendsCommon/memoryOptimizerStrategyLibrary/test /<<PKGBUILDDIR>>/build-area /<<PKGBUILDDIR>>/build-area/src/backends/backendsCommon/memoryOptimizerStrategyLibrary/test /<<PKGBUILDDIR>>/build-area/src/backends/backendsCommon/memoryOptimizerStrategyLibrary/test/CMakeFiles/armnnMemoryOptimizationStrategiesUnitTests.dir/DependInfo.cmake "--color="
make[3]: Entering directory '/<<PKGBUILDDIR>>/build-area'
make[3]: Entering directory '/<<PKGBUILDDIR>>/build-area'
cd /<<PKGBUILDDIR>>/build-area && /usr/bin/cmake -E cmake_depends "Unix Makefiles" /<<PKGBUILDDIR>> /<<PKGBUILDDIR>>/tests /<<PKGBUILDDIR>>/build-area /<<PKGBUILDDIR>>/build-area/tests /<<PKGBUILDDIR>>/build-area/tests/CMakeFiles/inferenceTest.dir/DependInfo.cmake "--color="
make[3]: Entering directory '/<<PKGBUILDDIR>>/build-area'
cd /<<PKGBUILDDIR>>/build-area && /usr/bin/cmake -E cmake_depends "Unix Makefiles" /<<PKGBUILDDIR>> /<<PKGBUILDDIR>>/src/backends/aclCommon /<<PKGBUILDDIR>>/build-area /<<PKGBUILDDIR>>/build-area/src/backends/aclCommon /<<PKGBUILDDIR>>/build-area/src/backends/aclCommon/CMakeFiles/armnnAclCommon.dir/DependInfo.cmake "--color="
make[3]: Leaving directory '/<<PKGBUILDDIR>>/build-area'
make -f src/backends/backendsCommon/memoryOptimizerStrategyLibrary/CMakeFiles/armnnMemoryOptimizationStrategies.dir/build.make src/backends/backendsCommon/memoryOptimizerStrategyLibrary/CMakeFiles/armnnMemoryOptimizationStrategies.dir/build
[ 0%] Generating /<<PKGBUILDDIR>>/generated/ArmnnSchema_generated.h
make[3]: Leaving directory '/<<PKGBUILDDIR>>/build-area'
make -f CMakeFiles/armnnUtils.dir/build.make CMakeFiles/armnnUtils.dir/build
make[3]: Leaving directory '/<<PKGBUILDDIR>>/build-area'
make[3]: Leaving directory '/<<PKGBUILDDIR>>/build-area'
make -f src/backends/backendsCommon/memoryOptimizerStrategyLibrary/test/CMakeFiles/armnnMemoryOptimizationStrategiesUnitTests.dir/build.make src/backends/backendsCommon/memoryOptimizerStrategyLibrary/test/CMakeFiles/armnnMemoryOptimizationStrategiesUnitTests.dir/build
make -f src/backends/backendsCommon/CMakeFiles/armnnBackendsCommon.dir/build.make src/backends/backendsCommon/CMakeFiles/armnnBackendsCommon.dir/build
cd /<<PKGBUILDDIR>>/build-area/src/armnnSerializer && /usr/bin/flatc -o /<<PKGBUILDDIR>>/src/armnnSerializer/../../generated --cpp /<<PKGBUILDDIR>>/src/armnnSerializer/ArmnnSchema.fbs
make[3]: Entering directory '/<<PKGBUILDDIR>>/build-area'
make[3]: Entering directory '/<<PKGBUILDDIR>>/build-area'
make[3]: Leaving directory '/<<PKGBUILDDIR>>/build-area'
make[3]: Entering directory '/<<PKGBUILDDIR>>/build-area'
make -f tests/CMakeFiles/inferenceTest.dir/build.make tests/CMakeFiles/inferenceTest.dir/build
make[3]: Leaving directory '/<<PKGBUILDDIR>>/build-area'
make -f third-party/fmt/CMakeFiles/fmt.dir/build.make third-party/fmt/CMakeFiles/fmt.dir/build
make[3]: Entering directory '/<<PKGBUILDDIR>>/build-area'
make[3]: Leaving directory '/<<PKGBUILDDIR>>/build-area'
make -f src/backends/aclCommon/CMakeFiles/armnnAclCommon.dir/build.make src/backends/aclCommon/CMakeFiles/armnnAclCommon.dir/build
make[3]: Entering directory '/<<PKGBUILDDIR>>/build-area'
make[3]: Entering directory '/<<PKGBUILDDIR>>/build-area'
make[3]: Entering directory '/<<PKGBUILDDIR>>/build-area'
warning:
/<<PKGBUILDDIR>>/src/armnnSerializer/ArmnnSchema.fbs:68: 12: warning: field names should be lowercase snake_case, got: dataType
/<<PKGBUILDDIR>>/src/armnnSerializer/ArmnnSchema.fbs:69: 21: warning: field names should be lowercase snake_case, got: quantizationScale
/<<PKGBUILDDIR>>/src/armnnSerializer/ArmnnSchema.fbs:70: 22: warning: field names should be lowercase snake_case, got: quantizationOffset
/<<PKGBUILDDIR>>/src/armnnSerializer/ArmnnSchema.fbs:71: 22: warning: field names should be lowercase snake_case, got: quantizationScales
/<<PKGBUILDDIR>>/src/armnnSerializer/ArmnnSchema.fbs:72: 19: warning: field names should be lowercase snake_case, got: quantizationDim
/<<PKGBUILDDIR>>/src/armnnSerializer/ArmnnSchema.fbs:74: 24: warning: field names should be lowercase snake_case, got: dimensionSpecificity
/<<PKGBUILDDIR>>/src/armnnSerializer/ArmnnSchema.fbs:75: 14: warning: field names should be lowercase snake_case, got: isConstant
/<<PKGBUILDDIR>>/src/armnnSerializer/ArmnnSchema.fbs:79: 20: warning: field names should be lowercase snake_case, got: sourceLayerIndex
/<<PKGBUILDDIR>>/src/armnnSerializer/ArmnnSchema.fbs:80: 19: warning: field names should be lowercase snake_case, got: outputSlotIndex
/<<PKGBUILDDIR>>/src/armnnSerializer/ArmnnSchema.fbs:109: 16: warning: field names should be lowercase snake_case, got: isOverridden
/<<PKGBUILDDIR>>/src/armnnSerializer/ArmnnSchema.fbs:110: 24: warning: field names should be lowercase snake_case, got: overriddenTensorInfo
/<<PKGBUILDDIR>>/src/armnnSerializer/ArmnnSchema.fbs:115: 14: warning: field names should be lowercase snake_case, got: tensorInfo
/<<PKGBUILDDIR>>/src/armnnSerializer/ArmnnSchema.fbs:196: 13: warning: field names should be lowercase snake_case, got: layerName
/<<PKGBUILDDIR>>/src/armnnSerializer/ArmnnSchema.fbs:197: 13: warning: field names should be lowercase snake_case, got: layerType
/<<PKGBUILDDIR>>/src/armnnSerializer/ArmnnSchema.fbs:198: 14: warning: field names should be lowercase snake_case, got: inputSlots
/<<PKGBUILDDIR>>/src/armnnSerializer/ArmnnSchema.fbs:199: 15: warning: field names should be lowercase snake_case, got: outputSlots
/<<PKGBUILDDIR>>/src/armnnSerializer/ArmnnSchema.fbs:204: 18: warning: field names should be lowercase snake_case, got: layerBindingId
/<<PKGBUILDDIR>>/src/armnnSerializer/ArmnnSchema.fbs:220: 22: warning: field names should be lowercase snake_case, got: activationFunction
/<<PKGBUILDDIR>>/src/armnnSerializer/ArmnnSchema.fbs:235: 21: warning: field names should be lowercase snake_case, got: argMinMaxFunction
/<<PKGBUILDDIR>>/src/armnnSerializer/ArmnnSchema.fbs:250: 13: warning: field names should be lowercase snake_case, got: numGroups
/<<PKGBUILDDIR>>/src/armnnSerializer/ArmnnSchema.fbs:284: 11: warning: field names should be lowercase snake_case, got: padLeft
/<<PKGBUILDDIR>>/src/armnnSerializer/ArmnnSchema.fbs:285: 12: warning: field names should be lowercase snake_case, got: padRight
/<<PKGBUILDDIR>>/src/armnnSerializer/ArmnnSchema.fbs:286: 10: warning: field names should be lowercase snake_case, got: padTop
/<<PKGBUILDDIR>>/src/armnnSerializer/ArmnnSchema.fbs:287: 13: warning: field names should be lowercase snake_case, got: padBottom
/<<PKGBUILDDIR>>/src/armnnSerializer/ArmnnSchema.fbs:288: 11: warning: field names should be lowercase snake_case, got: strideX
/<<PKGBUILDDIR>>/src/armnnSerializer/ArmnnSchema.fbs:289: 11: warning: field names should be lowercase snake_case, got: strideY
/<<PKGBUILDDIR>>/src/armnnSerializer/ArmnnSchema.fbs:290: 13: warning: field names should be lowercase snake_case, got: dilationX
/<<PKGBUILDDIR>>/src/armnnSerializer/ArmnnSchema.fbs:291: 13: warning: field names should be lowercase snake_case, got: dilationY
/<<PKGBUILDDIR>>/src/armnnSerializer/ArmnnSchema.fbs:292: 15: warning: field names should be lowercase snake_case, got: biasEnabled
/<<PKGBUILDDIR>>/src/armnnSerializer/ArmnnSchema.fbs:293: 14: warning: field names should be lowercase snake_case, got: dataLayout
/<<PKGBUILDDIR>>/src/armnnSerializer/ArmnnSchema.fbs:302: 11: warning: field names should be lowercase snake_case, got: padLeft
/<<PKGBUILDDIR>>/src/armnnSerializer/ArmnnSchema.fbs:303: 12: warning: field names should be lowercase snake_case, got: padRight
/<<PKGBUILDDIR>>/src/armnnSerializer/ArmnnSchema.fbs:304: 10: warning: field names should be lowercase snake_case, got: padTop
/<<PKGBUILDDIR>>/src/armnnSerializer/ArmnnSchema.fbs:305: 13: warning: field names should be lowercase snake_case, got: padBottom
/<<PKGBUILDDIR>>/src/armnnSerializer/ArmnnSchema.fbs:306: 12: warning: field names should be lowercase snake_case, got: padFront
/<<PKGBUILDDIR>>/src/armnnSerializer/ArmnnSchema.fbs:307: 11: warning: field names should be lowercase snake_case, got: padBack
/<<PKGBUILDDIR>>/src/armnnSerializer/ArmnnSchema.fbs:308: 11: warning: field names should be lowercase snake_case, got: strideX
/<<PKGBUILDDIR>>/src/armnnSerializer/ArmnnSchema.fbs:309: 11: warning: field names should be lowercase snake_case, got: strideY
/<<PKGBUILDDIR>>/src/armnnSerializer/ArmnnSchema.fbs:310: 11: warning: field names should be lowercase snake_case, got: strideZ
/<<PKGBUILDDIR>>/src/armnnSerializer/ArmnnSchema.fbs:311: 13: warning: field names should be lowercase snake_case, got: dilationX
/<<PKGBUILDDIR>>/src/armnnSerializer/ArmnnSchema.fbs:312: 13: warning: field names should be lowercase snake_case, got: dilationY
/<<PKGBUILDDIR>>/src/armnnSerializer/ArmnnSchema.fbs:313: 13: warning: field names should be lowercase snake_case, got: dilationZ
/<<PKGBUILDDIR>>/src/armnnSerializer/ArmnnSchema.fbs:314: 15: warning: field names should be lowercase snake_case, got: biasEnabled
/<<PKGBUILDDIR>>/src/armnnSerializer/ArmnnSchema.fbs:315: 14: warning: field names should be lowercase snake_case, got: dataLayout
/<<PKGBUILDDIR>>/src/armnnSerializer/ArmnnSchema.fbs:324: 13: warning: field names should be lowercase snake_case, got: blockSize
/<<PKGBUILDDIR>>/src/armnnSerializer/ArmnnSchema.fbs:325: 14: warning: field names should be lowercase snake_case, got: dataLayout
/<<PKGBUILDDIR>>/src/armnnSerializer/ArmnnSchema.fbs:399: 15: warning: field names should be lowercase snake_case, got: biasEnabled
/<<PKGBUILDDIR>>/src/armnnSerializer/ArmnnSchema.fbs:400: 26: warning: field names should be lowercase snake_case, got: transposeWeightsMatrix
/<<PKGBUILDDIR>>/src/armnnSerializer/ArmnnSchema.fbs:401: 19: warning: field names should be lowercase snake_case, got: constantWeights
/<<PKGBUILDDIR>>/src/armnnSerializer/ArmnnSchema.fbs:435: 14: warning: field names should be lowercase snake_case, got: dataLayout
/<<PKGBUILDDIR>>/src/armnnSerializer/ArmnnSchema.fbs:454: 14: warning: field names should be lowercase snake_case, got: dataLayout
/<<PKGBUILDDIR>>/src/armnnSerializer/ArmnnSchema.fbs:511: 12: warning: field names should be lowercase snake_case, got: poolType
/<<PKGBUILDDIR>>/src/armnnSerializer/ArmnnSchema.fbs:512: 11: warning: field names should be lowercase snake_case, got: padLeft
/<<PKGBUILDDIR>>/src/armnnSerializer/ArmnnSchema.fbs:513: 12: warning: field names should be lowercase snake_case, got: padRight
/<<PKGBUILDDIR>>/src/armnnSerializer/ArmnnSchema.fbs:514: 10: warning: field names should be lowercase snake_case, got: padTop
/<<PKGBUILDDIR>>/src/armnnSerializer/ArmnnSchema.fbs:515: 13: warning: field names should be lowercase snake_case, got: padBottom
/<<PKGBUILDDIR>>/src/armnnSerializer/ArmnnSchema.fbs:516: 13: warning: field names should be lowercase snake_case, got: poolWidth
/<<PKGBUILDDIR>>/src/armnnSerializer/ArmnnSchema.fbs:517: 14: warning: field names should be lowercase snake_case, got: poolHeight
/<<PKGBUILDDIR>>/src/armnnSerializer/ArmnnSchema.fbs:518: 11: warning: field names should be lowercase snake_case, got: strideX
/<<PKGBUILDDIR>>/src/armnnSerializer/ArmnnSchema.fbs:519: 11: warning: field names should be lowercase snake_case, got: strideY
/<<PKGBUILDDIR>>/src/armnnSerializer/ArmnnSchema.fbs:520: 23: warning: field names should be lowercase snake_case, got: outputShapeRounding
/<<PKGBUILDDIR>>/src/armnnSerializer/ArmnnSchema.fbs:521: 17: warning: field names should be lowercase snake_case, got: paddingMethod
/<<PKGBUILDDIR>>/src/armnnSerializer/ArmnnSchema.fbs:522: 14: warning: field names should be lowercase snake_case, got: dataLayout
/<<PKGBUILDDIR>>/src/armnnSerializer/ArmnnSchema.fbs:526: 12: warning: field names should be lowercase snake_case, got: poolType
/<<PKGBUILDDIR>>/src/armnnSerializer/ArmnnSchema.fbs:527: 11: warning: field names should be lowercase snake_case, got: padLeft
/<<PKGBUILDDIR>>/src/armnnSerializer/ArmnnSchema.fbs:528: 12: warning: field names should be lowercase snake_case, got: padRight
/<<PKGBUILDDIR>>/src/armnnSerializer/ArmnnSchema.fbs:529: 10: warning: field names should be lowercase snake_case, got: padTop
/<<PKGBUILDDIR>>/src/armnnSerializer/ArmnnSchema.fbs:530: 13: warning: field names should be lowercase snake_case, got: padBottom
/<<PKGBUILDDIR>>/src/armnnSerializer/ArmnnSchema.fbs:531: 12: warning: field names should be lowercase snake_case, got: padFront
/<<PKGBUILDDIR>>/src/armnnSerializer/ArmnnSchema.fbs:532: 11: warning: field names should be lowercase snake_case, got: padBack
/<<PKGBUILDDIR>>/src/armnnSerializer/ArmnnSchema.fbs:533: 13: warning: field names should be lowercase snake_case, got: poolWidth
/<<PKGBUILDDIR>>/src/armnnSerializer/ArmnnSchema.fbs:534: 14: warning: field names should be lowercase snake_case, got: poolHeight
/<<PKGBUILDDIR>>/src/armnnSerializer/ArmnnSchema.fbs:535: 13: warning: field names should be lowercase snake_case, got: poolDepth
/<<PKGBUILDDIR>>/src/armnnSerializer/ArmnnSchema.fbs:536: 11: warning: field names should be lowercase snake_case, got: strideX
/<<PKGBUILDDIR>>/src/armnnSerializer/ArmnnSchema.fbs:537: 11: warning: field names should be lowercase snake_case, got: strideY
/<<PKGBUILDDIR>>/src/armnnSerializer/ArmnnSchema.fbs:538: 11: warning: field names should be lowercase snake_case, got: strideZ
/<<PKGBUILDDIR>>/src/armnnSerializer/ArmnnSchema.fbs:539: 23: warning: field names should be lowercase snake_case, got: outputShapeRounding
/<<PKGBUILDDIR>>/src/armnnSerializer/ArmnnSchema.fbs:540: 17: warning: field names should be lowercase snake_case, got: paddingMethod
/<<PKGBUILDDIR>>/src/armnnSerializer/ArmnnSchema.fbs:541: 14: warning: field names should be lowercase snake_case, got: dataLayout
/<<PKGBUILDDIR>>/src/armnnSerializer/ArmnnSchema.fbs:566: 11: warning: field names should be lowercase snake_case, got: padLeft
/<<PKGBUILDDIR>>/src/armnnSerializer/ArmnnSchema.fbs:567: 12: warning: field names should be lowercase snake_case, got: padRight
/<<PKGBUILDDIR>>/src/armnnSerializer/ArmnnSchema.fbs:568: 10: warning: field names should be lowercase snake_case, got: padTop
/<<PKGBUILDDIR>>/src/armnnSerializer/ArmnnSchema.fbs:569: 13: warning: field names should be lowercase snake_case, got: padBottom
/<<PKGBUILDDIR>>/src/armnnSerializer/ArmnnSchema.fbs:570: 11: warning: field names should be lowercase snake_case, got: strideX
/<<PKGBUILDDIR>>/src/armnnSerializer/ArmnnSchema.fbs:571: 11: warning: field names should be lowercase snake_case, got: strideY
/<<PKGBUILDDIR>>/src/armnnSerializer/ArmnnSchema.fbs:572: 13: warning: field names should be lowercase snake_case, got: dilationX
/<<PKGBUILDDIR>>/src/armnnSerializer/ArmnnSchema.fbs:573: 13: warning: field names should be lowercase snake_case, got: dilationY
/<<PKGBUILDDIR>>/src/armnnSerializer/ArmnnSchema.fbs:574: 15: warning: field names should be lowercase snake_case, got: biasEnabled
/<<PKGBUILDDIR>>/src/armnnSerializer/ArmnnSchema.fbs:575: 14: warning: field names should be lowercase snake_case, got: dataLayout
/<<PKGBUILDDIR>>/src/armnnSerializer/ArmnnSchema.fbs:588: 15: warning: field names should be lowercase snake_case, got: targetShape
/<<PKGBUILDDIR>>/src/armnnSerializer/ArmnnSchema.fbs:597: 15: warning: field names should be lowercase snake_case, got: dimMappings
/<<PKGBUILDDIR>>/src/armnnSerializer/ArmnnSchema.fbs:610: 14: warning: field names should be lowercase snake_case, got: blockShape
/<<PKGBUILDDIR>>/src/armnnSerializer/ArmnnSchema.fbs:611: 11: warning: field names should be lowercase snake_case, got: padList
/<<PKGBUILDDIR>>/src/armnnSerializer/ArmnnSchema.fbs:612: 14: warning: field names should be lowercase snake_case, got: dataLayout
/<<PKGBUILDDIR>>/src/armnnSerializer/ArmnnSchema.fbs:621: 13: warning: field names should be lowercase snake_case, got: blockSize
/<<PKGBUILDDIR>>/src/armnnSerializer/ArmnnSchema.fbs:622: 14: warning: field names should be lowercase snake_case, got: dataLayout
/<<PKGBUILDDIR>>/src/armnnSerializer/ArmnnSchema.fbs:635: 14: warning: field names should be lowercase snake_case, got: blockShape
/<<PKGBUILDDIR>>/src/armnnSerializer/ArmnnSchema.fbs:637: 14: warning: field names should be lowercase snake_case, got: dataLayout
/<<PKGBUILDDIR>>/src/armnnSerializer/ArmnnSchema.fbs:656: 19: warning: field names should be lowercase snake_case, got: normChannelType
/<<PKGBUILDDIR>>/src/armnnSerializer/ArmnnSchema.fbs:657: 18: warning: field names should be lowercase snake_case, got: normMethodType
/<<PKGBUILDDIR>>/src/armnnSerializer/ArmnnSchema.fbs:658: 12: warning: field names should be lowercase snake_case, got: normSize
/<<PKGBUILDDIR>>/src/armnnSerializer/ArmnnSchema.fbs:662: 14: warning: field names should be lowercase snake_case, got: dataLayout
/<<PKGBUILDDIR>>/src/armnnSerializer/ArmnnSchema.fbs:672: 12: warning: field names should be lowercase snake_case, got: keepDims
/<<PKGBUILDDIR>>/src/armnnSerializer/ArmnnSchema.fbs:687: 11: warning: field names should be lowercase snake_case, got: padList
/<<PKGBUILDDIR>>/src/armnnSerializer/ArmnnSchema.fbs:688: 12: warning: field names should be lowercase snake_case, got: padValue
/<<PKGBUILDDIR>>/src/armnnSerializer/ArmnnSchema.fbs:689: 15: warning: field names should be lowercase snake_case, got: paddingMode
/<<PKGBUILDDIR>>/src/armnnSerializer/ArmnnSchema.fbs:708: 14: warning: field names should be lowercase snake_case, got: dataLayout
/<<PKGBUILDDIR>>/src/armnnSerializer/ArmnnSchema.fbs:718: 15: warning: field names should be lowercase snake_case, got: targetWidth
/<<PKGBUILDDIR>>/src/armnnSerializer/ArmnnSchema.fbs:719: 16: warning: field names should be lowercase snake_case, got: targetHeight
/<<PKGBUILDDIR>>/src/armnnSerializer/ArmnnSchema.fbs:720: 14: warning: field names should be lowercase snake_case, got: dataLayout
/<<PKGBUILDDIR>>/src/armnnSerializer/ArmnnSchema.fbs:721: 16: warning: field names should be lowercase snake_case, got: alignCorners
/<<PKGBUILDDIR>>/src/armnnSerializer/ArmnnSchema.fbs:722: 20: warning: field names should be lowercase snake_case, got: halfPixelCenters
/<<PKGBUILDDIR>>/src/armnnSerializer/ArmnnSchema.fbs:744: 13: warning: field names should be lowercase snake_case, got: beginMask
/<<PKGBUILDDIR>>/src/armnnSerializer/ArmnnSchema.fbs:745: 11: warning: field names should be lowercase snake_case, got: endMask
/<<PKGBUILDDIR>>/src/armnnSerializer/ArmnnSchema.fbs:746: 18: warning: field names should be lowercase snake_case, got: shrinkAxisMask
/<<PKGBUILDDIR>>/src/armnnSerializer/ArmnnSchema.fbs:747: 16: warning: field names should be lowercase snake_case, got: ellipsisMask
/<<PKGBUILDDIR>>/src/armnnSerializer/ArmnnSchema.fbs:748: 15: warning: field names should be lowercase snake_case, got: newAxisMask
/<<PKGBUILDDIR>>/src/armnnSerializer/ArmnnSchema.fbs:749: 14: warning: field names should be lowercase snake_case, got: dataLayout
/<<PKGBUILDDIR>>/src/armnnSerializer/ArmnnSchema.fbs:768: 13: warning: field names should be lowercase snake_case, got: concatAxis
/<<PKGBUILDDIR>>/src/armnnSerializer/ArmnnSchema.fbs:769: 11: warning: field names should be lowercase snake_case, got: numViews
/<<PKGBUILDDIR>>/src/armnnSerializer/ArmnnSchema.fbs:770: 16: warning: field names should be lowercase snake_case, got: numDimensions
/<<PKGBUILDDIR>>/src/armnnSerializer/ArmnnSchema.fbs:771: 14: warning: field names should be lowercase snake_case, got: viewOrigins
/<<PKGBUILDDIR>>/src/armnnSerializer/ArmnnSchema.fbs:776: 12: warning: field names should be lowercase snake_case, got: viewSizes
/<<PKGBUILDDIR>>/src/armnnSerializer/ArmnnSchema.fbs:777: 10: warning: field names should be lowercase snake_case, got: hasAxis
/<<PKGBUILDDIR>>/src/armnnSerializer/ArmnnSchema.fbs:793: 17: warning: field names should be lowercase snake_case, got: maxDetections
/<<PKGBUILDDIR>>/src/armnnSerializer/ArmnnSchema.fbs:794: 26: warning: field names should be lowercase snake_case, got: maxClassesPerDetection
/<<PKGBUILDDIR>>/src/armnnSerializer/ArmnnSchema.fbs:795: 22: warning: field names should be lowercase snake_case, got: detectionsPerClass
/<<PKGBUILDDIR>>/src/armnnSerializer/ArmnnSchema.fbs:796: 21: warning: field names should be lowercase snake_case, got: nmsScoreThreshold
/<<PKGBUILDDIR>>/src/armnnSerializer/ArmnnSchema.fbs:797: 19: warning: field names should be lowercase snake_case, got: nmsIouThreshold
/<<PKGBUILDDIR>>/src/armnnSerializer/ArmnnSchema.fbs:798: 14: warning: field names should be lowercase snake_case, got: numClasses
/<<PKGBUILDDIR>>/src/armnnSerializer/ArmnnSchema.fbs:799: 17: warning: field names should be lowercase snake_case, got: useRegularNms
/<<PKGBUILDDIR>>/src/armnnSerializer/ArmnnSchema.fbs:800: 10: warning: field names should be lowercase snake_case, got: scaleX
/<<PKGBUILDDIR>>/src/armnnSerializer/ArmnnSchema.fbs:801: 10: warning: field names should be lowercase snake_case, got: scaleY
/<<PKGBUILDDIR>>/src/armnnSerializer/ArmnnSchema.fbs:802: 10: warning: field names should be lowercase snake_case, got: scaleW
/<<PKGBUILDDIR>>/src/armnnSerializer/ArmnnSchema.fbs:803: 10: warning: field names should be lowercase snake_case, got: scaleH
/<<PKGBUILDDIR>>/src/armnnSerializer/ArmnnSchema.fbs:807: 24: warning: field names should be lowercase snake_case, got: inputToForgetWeights
/<<PKGBUILDDIR>>/src/armnnSerializer/ArmnnSchema.fbs:808: 22: warning: field names should be lowercase snake_case, got: inputToCellWeights
/<<PKGBUILDDIR>>/src/armnnSerializer/ArmnnSchema.fbs:809: 24: warning: field names should be lowercase snake_case, got: inputToOutputWeights
/<<PKGBUILDDIR>>/src/armnnSerializer/ArmnnSchema.fbs:810: 28: warning: field names should be lowercase snake_case, got: recurrentToForgetWeights
/<<PKGBUILDDIR>>/src/armnnSerializer/ArmnnSchema.fbs:811: 26: warning: field names should be lowercase snake_case, got: recurrentToCellWeights
/<<PKGBUILDDIR>>/src/armnnSerializer/ArmnnSchema.fbs:812: 28: warning: field names should be lowercase snake_case, got: recurrentToOutputWeights
/<<PKGBUILDDIR>>/src/armnnSerializer/ArmnnSchema.fbs:813: 18: warning: field names should be lowercase snake_case, got: forgetGateBias
/<<PKGBUILDDIR>>/src/armnnSerializer/ArmnnSchema.fbs:814: 12: warning: field names should be lowercase snake_case, got: cellBias
/<<PKGBUILDDIR>>/src/armnnSerializer/ArmnnSchema.fbs:815: 18: warning: field names should be lowercase snake_case, got: outputGateBias
/<<PKGBUILDDIR>>/src/armnnSerializer/ArmnnSchema.fbs:817: 23: warning: field names should be lowercase snake_case, got: inputToInputWeights
/<<PKGBUILDDIR>>/src/armnnSerializer/ArmnnSchema.fbs:818: 27: warning: field names should be lowercase snake_case, got: recurrentToInputWeights
/<<PKGBUILDDIR>>/src/armnnSerializer/ArmnnSchema.fbs:819: 22: warning: field names should be lowercase snake_case, got: cellToInputWeights
/<<PKGBUILDDIR>>/src/armnnSerializer/ArmnnSchema.fbs:820: 17: warning: field names should be lowercase snake_case, got: inputGateBias
/<<PKGBUILDDIR>>/src/armnnSerializer/ArmnnSchema.fbs:822: 21: warning: field names should be lowercase snake_case, got: projectionWeights
/<<PKGBUILDDIR>>/src/armnnSerializer/ArmnnSchema.fbs:823: 18: warning: field names should be lowercase snake_case, got: projectionBias
/<<PKGBUILDDIR>>/src/armnnSerializer/ArmnnSchema.fbs:825: 23: warning: field names should be lowercase snake_case, got: cellToForgetWeights
/<<PKGBUILDDIR>>/src/armnnSerializer/ArmnnSchema.fbs:826: 23: warning: field names should be lowercase snake_case, got: cellToOutputWeights
/<<PKGBUILDDIR>>/src/armnnSerializer/ArmnnSchema.fbs:828: 25: warning: field names should be lowercase snake_case, got: inputLayerNormWeights
/<<PKGBUILDDIR>>/src/armnnSerializer/ArmnnSchema.fbs:829: 26: warning: field names should be lowercase snake_case, got: forgetLayerNormWeights
/<<PKGBUILDDIR>>/src/armnnSerializer/ArmnnSchema.fbs:830: 24: warning: field names should be lowercase snake_case, got: cellLayerNormWeights
/<<PKGBUILDDIR>>/src/armnnSerializer/ArmnnSchema.fbs:831: 26: warning: field names should be lowercase snake_case, got: outputLayerNormWeights
/<<PKGBUILDDIR>>/src/armnnSerializer/ArmnnSchema.fbs:835: 18: warning: field names should be lowercase snake_case, got: activationFunc
/<<PKGBUILDDIR>>/src/armnnSerializer/ArmnnSchema.fbs:836: 21: warning: field names should be lowercase snake_case, got: clippingThresCell
/<<PKGBUILDDIR>>/src/armnnSerializer/ArmnnSchema.fbs:837: 21: warning: field names should be lowercase snake_case, got: clippingThresProj
/<<PKGBUILDDIR>>/src/armnnSerializer/ArmnnSchema.fbs:838: 15: warning: field names should be lowercase snake_case, got: cifgEnabled
/<<PKGBUILDDIR>>/src/armnnSerializer/ArmnnSchema.fbs:839: 19: warning: field names should be lowercase snake_case, got: peepholeEnabled
/<<PKGBUILDDIR>>/src/armnnSerializer/ArmnnSchema.fbs:840: 21: warning: field names should be lowercase snake_case, got: projectionEnabled
/<<PKGBUILDDIR>>/src/armnnSerializer/ArmnnSchema.fbs:841: 20: warning: field names should be lowercase snake_case, got: layerNormEnabled
/<<PKGBUILDDIR>>/src/armnnSerializer/ArmnnSchema.fbs:847: 15: warning: field names should be lowercase snake_case, got: inputParams
/<<PKGBUILDDIR>>/src/armnnSerializer/ArmnnSchema.fbs:852: 24: warning: field names should be lowercase snake_case, got: inputToForgetWeights
/<<PKGBUILDDIR>>/src/armnnSerializer/ArmnnSchema.fbs:853: 22: warning: field names should be lowercase snake_case, got: inputToCellWeights
/<<PKGBUILDDIR>>/src/armnnSerializer/ArmnnSchema.fbs:854: 24: warning: field names should be lowercase snake_case, got: inputToOutputWeights
/<<PKGBUILDDIR>>/src/armnnSerializer/ArmnnSchema.fbs:856: 28: warning: field names should be lowercase snake_case, got: recurrentToForgetWeights
/<<PKGBUILDDIR>>/src/armnnSerializer/ArmnnSchema.fbs:857: 26: warning: field names should be lowercase snake_case, got: recurrentToCellWeights
/<<PKGBUILDDIR>>/src/armnnSerializer/ArmnnSchema.fbs:858: 28: warning: field names should be lowercase snake_case, got: recurrentToOutputWeights
/<<PKGBUILDDIR>>/src/armnnSerializer/ArmnnSchema.fbs:860: 18: warning: field names should be lowercase snake_case, got: forgetGateBias
/<<PKGBUILDDIR>>/src/armnnSerializer/ArmnnSchema.fbs:861: 12: warning: field names should be lowercase snake_case, got: cellBias
/<<PKGBUILDDIR>>/src/armnnSerializer/ArmnnSchema.fbs:862: 18: warning: field names should be lowercase snake_case, got: outputGateBias
/<<PKGBUILDDIR>>/src/armnnSerializer/ArmnnSchema.fbs:865: 23: warning: field names should be lowercase snake_case, got: inputToInputWeights
/<<PKGBUILDDIR>>/src/armnnSerializer/ArmnnSchema.fbs:866: 27: warning: field names should be lowercase snake_case, got: recurrentToInputWeights
/<<PKGBUILDDIR>>/src/armnnSerializer/ArmnnSchema.fbs:867: 17: warning: field names should be lowercase snake_case, got: inputGateBias
/<<PKGBUILDDIR>>/src/armnnSerializer/ArmnnSchema.fbs:870: 21: warning: field names should be lowercase snake_case, got: projectionWeights
/<<PKGBUILDDIR>>/src/armnnSerializer/ArmnnSchema.fbs:871: 18: warning: field names should be lowercase snake_case, got: projectionBias
/<<PKGBUILDDIR>>/src/armnnSerializer/ArmnnSchema.fbs:874: 22: warning: field names should be lowercase snake_case, got: cellToInputWeights
/<<PKGBUILDDIR>>/src/armnnSerializer/ArmnnSchema.fbs:875: 23: warning: field names should be lowercase snake_case, got: cellToForgetWeights
/<<PKGBUILDDIR>>/src/armnnSerializer/ArmnnSchema.fbs:876: 23: warning: field names should be lowercase snake_case, got: cellToOutputWeights
/<<PKGBUILDDIR>>/src/armnnSerializer/ArmnnSchema.fbs:879: 25: warning: field names should be lowercase snake_case, got: inputLayerNormWeights
/<<PKGBUILDDIR>>/src/armnnSerializer/ArmnnSchema.fbs:880: 26: warning: field names should be lowercase snake_case, got: forgetLayerNormWeights
/<<PKGBUILDDIR>>/src/armnnSerializer/ArmnnSchema.fbs:881: 24: warning: field names should be lowercase snake_case, got: cellLayerNormWeights
/<<PKGBUILDDIR>>/src/armnnSerializer/ArmnnSchema.fbs:882: 26: warning: field names should be lowercase snake_case, got: outputLayerNormWeights
/<<PKGBUILDDIR>>/src/armnnSerializer/ArmnnSchema.fbs:886: 15: warning: field names should be lowercase snake_case, got: cifgEnabled
/<<PKGBUILDDIR>>/src/armnnSerializer/ArmnnSchema.fbs:887: 19: warning: field names should be lowercase snake_case, got: peepholeEnabled
/<<PKGBUILDDIR>>/src/armnnSerializer/ArmnnSchema.fbs:888: 21: warning: field names should be lowercase snake_case, got: projectionEnabled
/<<PKGBUILDDIR>>/src/armnnSerializer/ArmnnSchema.fbs:889: 20: warning: field names should be lowercase snake_case, got: layerNormEnabled
/<<PKGBUILDDIR>>/src/armnnSerializer/ArmnnSchema.fbs:891: 12: warning: field names should be lowercase snake_case, got: cellClip
/<<PKGBUILDDIR>>/src/armnnSerializer/ArmnnSchema.fbs:892: 18: warning: field names should be lowercase snake_case, got: projectionClip
/<<PKGBUILDDIR>>/src/armnnSerializer/ArmnnSchema.fbs:894: 26: warning: field names should be lowercase snake_case, got: inputIntermediateScale
/<<PKGBUILDDIR>>/src/armnnSerializer/ArmnnSchema.fbs:895: 27: warning: field names should be lowercase snake_case, got: forgetIntermediateScale
/<<PKGBUILDDIR>>/src/armnnSerializer/ArmnnSchema.fbs:896: 25: warning: field names should be lowercase snake_case, got: cellIntermediateScale
/<<PKGBUILDDIR>>/src/armnnSerializer/ArmnnSchema.fbs:897: 27: warning: field names should be lowercase snake_case, got: outputIntermediateScale
/<<PKGBUILDDIR>>/src/armnnSerializer/ArmnnSchema.fbs:899: 24: warning: field names should be lowercase snake_case, got: hiddenStateZeroPoint
/<<PKGBUILDDIR>>/src/armnnSerializer/ArmnnSchema.fbs:900: 20: warning: field names should be lowercase snake_case, got: hiddenStateScale
/<<PKGBUILDDIR>>/src/armnnSerializer/ArmnnSchema.fbs:906: 15: warning: field names should be lowercase snake_case, got: inputParams
/<<PKGBUILDDIR>>/src/armnnSerializer/ArmnnSchema.fbs:910: 23: warning: field names should be lowercase snake_case, got: inputToInputWeights
/<<PKGBUILDDIR>>/src/armnnSerializer/ArmnnSchema.fbs:911: 24: warning: field names should be lowercase snake_case, got: inputToForgetWeights
/<<PKGBUILDDIR>>/src/armnnSerializer/ArmnnSchema.fbs:912: 22: warning: field names should be lowercase snake_case, got: inputToCellWeights
/<<PKGBUILDDIR>>/src/armnnSerializer/ArmnnSchema.fbs:913: 24: warning: field names should be lowercase snake_case, got: inputToOutputWeights
/<<PKGBUILDDIR>>/src/armnnSerializer/ArmnnSchema.fbs:915: 27: warning: field names should be lowercase snake_case, got: recurrentToInputWeights
/<<PKGBUILDDIR>>/src/armnnSerializer/ArmnnSchema.fbs:916: 28: warning: field names should be lowercase snake_case, got: recurrentToForgetWeights
/<<PKGBUILDDIR>>/src/armnnSerializer/ArmnnSchema.fbs:917: 26: warning: field names should be lowercase snake_case, got: recurrentToCellWeights
/<<PKGBUILDDIR>>/src/armnnSerializer/ArmnnSchema.fbs:918: 28: warning: field names should be lowercase snake_case, got: recurrentToOutputWeights
/<<PKGBUILDDIR>>/src/armnnSerializer/ArmnnSchema.fbs:920: 17: warning: field names should be lowercase snake_case, got: inputGateBias
/<<PKGBUILDDIR>>/src/armnnSerializer/ArmnnSchema.fbs:921: 18: warning: field names should be lowercase snake_case, got: forgetGateBias
/<<PKGBUILDDIR>>/src/armnnSerializer/ArmnnSchema.fbs:922: 12: warning: field names should be lowercase snake_case, got: cellBias
/<<PKGBUILDDIR>>/src/armnnSerializer/ArmnnSchema.fbs:923: 18: warning: field names should be lowercase snake_case, got: outputGateBias
/<<PKGBUILDDIR>>/src/armnnSerializer/ArmnnSchema.fbs:928: 15: warning: field names should be lowercase snake_case, got: inputParams
/<<PKGBUILDDIR>>/src/armnnSerializer/ArmnnSchema.fbs:955: 11: warning: field names should be lowercase snake_case, got: padLeft
/<<PKGBUILDDIR>>/src/armnnSerializer/ArmnnSchema.fbs:956: 12: warning: field names should be lowercase snake_case, got: padRight
/<<PKGBUILDDIR>>/src/armnnSerializer/ArmnnSchema.fbs:957: 10: warning: field names should be lowercase snake_case, got: padTop
/<<PKGBUILDDIR>>/src/armnnSerializer/ArmnnSchema.fbs:958: 13: warning: field names should be lowercase snake_case, got: padBottom
/<<PKGBUILDDIR>>/src/armnnSerializer/ArmnnSchema.fbs:959: 11: warning: field names should be lowercase snake_case, got: strideX
/<<PKGBUILDDIR>>/src/armnnSerializer/ArmnnSchema.fbs:960: 11: warning: field names should be lowercase snake_case, got: strideY
/<<PKGBUILDDIR>>/src/armnnSerializer/ArmnnSchema.fbs:961: 15: warning: field names should be lowercase snake_case, got: biasEnabled
/<<PKGBUILDDIR>>/src/armnnSerializer/ArmnnSchema.fbs:962: 14: warning: field names should be lowercase snake_case, got: dataLayout
/<<PKGBUILDDIR>>/src/armnnSerializer/ArmnnSchema.fbs:971: 15: warning: field names should be lowercase snake_case, got: dimMappings
/<<PKGBUILDDIR>>/src/armnnSerializer/ArmnnSchema.fbs:980: 16: warning: field names should be lowercase snake_case, got: targetHeight
/<<PKGBUILDDIR>>/src/armnnSerializer/ArmnnSchema.fbs:981: 15: warning: field names should be lowercase snake_case, got: targetWidth
/<<PKGBUILDDIR>>/src/armnnSerializer/ArmnnSchema.fbs:983: 14: warning: field names should be lowercase snake_case, got: dataLayout
/<<PKGBUILDDIR>>/src/armnnSerializer/ArmnnSchema.fbs:984: 16: warning: field names should be lowercase snake_case, got: alignCorners
/<<PKGBUILDDIR>>/src/armnnSerializer/ArmnnSchema.fbs:985: 20: warning: field names should be lowercase snake_case, got: halfPixelCenters
/<<PKGBUILDDIR>>/src/armnnSerializer/ArmnnSchema.fbs:999: 13: warning: field names should be lowercase snake_case, got: numInputs
/<<PKGBUILDDIR>>/src/armnnSerializer/ArmnnSchema.fbs:1000: 14: warning: field names should be lowercase snake_case, got: inputShape
/<<PKGBUILDDIR>>/src/armnnSerializer/ArmnnSchema.fbs:1004: 13: warning: field names should be lowercase snake_case, got: numInputs
/<<PKGBUILDDIR>>/src/armnnSerializer/ArmnnSchema.fbs:1005: 14: warning: field names should be lowercase snake_case, got: numOutputs
/<<PKGBUILDDIR>>/src/armnnSerializer/ArmnnSchema.fbs:1023: 12: warning: field names should be lowercase snake_case, got: keepDims
/<<PKGBUILDDIR>>/src/armnnSerializer/ArmnnSchema.fbs:1025: 19: warning: field names should be lowercase snake_case, got: reduceOperation
/<<PKGBUILDDIR>>/src/armnnSerializer/ArmnnSchema.fbs:1029: 18: warning: field names should be lowercase snake_case, got: activationFunc
/<<PKGBUILDDIR>>/src/armnnSerializer/ArmnnSchema.fbs:1030: 21: warning: field names should be lowercase snake_case, got: clippingThresCell
/<<PKGBUILDDIR>>/src/armnnSerializer/ArmnnSchema.fbs:1031: 21: warning: field names should be lowercase snake_case, got: clippingThresProj
/<<PKGBUILDDIR>>/src/armnnSerializer/ArmnnSchema.fbs:1032: 15: warning: field names should be lowercase snake_case, got: cifgEnabled
/<<PKGBUILDDIR>>/src/armnnSerializer/ArmnnSchema.fbs:1033: 19: warning: field names should be lowercase snake_case, got: peepholeEnabled
/<<PKGBUILDDIR>>/src/armnnSerializer/ArmnnSchema.fbs:1034: 21: warning: field names should be lowercase snake_case, got: projectionEnabled
/<<PKGBUILDDIR>>/src/armnnSerializer/ArmnnSchema.fbs:1035: 20: warning: field names should be lowercase snake_case, got: layerNormEnabled
/<<PKGBUILDDIR>>/src/armnnSerializer/ArmnnSchema.fbs:1036: 13: warning: field names should be lowercase snake_case, got: timeMajor
/<<PKGBUILDDIR>>/src/armnnSerializer/ArmnnSchema.fbs:1042: 15: warning: field names should be lowercase snake_case, got: inputParams
/<<PKGBUILDDIR>>/src/armnnSerializer/ArmnnSchema.fbs:1046: 14: warning: field names should be lowercase snake_case, got: transposeX
/<<PKGBUILDDIR>>/src/armnnSerializer/ArmnnSchema.fbs:1047: 14: warning: field names should be lowercase snake_case, got: transposeY
/<<PKGBUILDDIR>>/src/armnnSerializer/ArmnnSchema.fbs:1048: 12: warning: field names should be lowercase snake_case, got: adjointX
/<<PKGBUILDDIR>>/src/armnnSerializer/ArmnnSchema.fbs:1049: 12: warning: field names should be lowercase snake_case, got: adjointY
/<<PKGBUILDDIR>>/src/armnnSerializer/ArmnnSchema.fbs:1050: 15: warning: field names should be lowercase snake_case, got: dataLayoutX
/<<PKGBUILDDIR>>/src/armnnSerializer/ArmnnSchema.fbs:1051: 15: warning: field names should be lowercase snake_case, got: dataLayoutY
/<<PKGBUILDDIR>>/src/armnnSerializer/ArmnnSchema.fbs:1060: 14: warning: field names should be lowercase snake_case, got: m_Multiples
/<<PKGBUILDDIR>>/src/armnnSerializer/ArmnnSchema.fbs:1148: 18: warning: field names should be lowercase snake_case, got: bindingIdsScheme
/<<PKGBUILDDIR>>/src/armnnSerializer/ArmnnSchema.fbs:1149: 21: warning: field names should be lowercase snake_case, got: weightsLayoutScheme
/<<PKGBUILDDIR>>/src/armnnSerializer/ArmnnSchema.fbs:1150: 25: warning: field names should be lowercase snake_case, got: constantTensorsAsInputs
/<<PKGBUILDDIR>>/src/armnnSerializer/ArmnnSchema.fbs:1156: 12: warning: field names should be lowercase snake_case, got: inputIds
/<<PKGBUILDDIR>>/src/armnnSerializer/ArmnnSchema.fbs:1157: 13: warning: field names should be lowercase snake_case, got: outputIds
/<<PKGBUILDDIR>>/src/armnnSerializer/ArmnnSchema.fbs:1158: 19: warning: field names should be lowercase snake_case, got: featureVersions
[ 0%] Building CXX object src/backends/backendsCommon/memoryOptimizerStrategyLibrary/CMakeFiles/armnnMemoryOptimizationStrategies.dir/strategies/ConstantMemoryStrategy.cpp.o
[ 0%] Building CXX object CMakeFiles/armnnUtils.dir/src/armnnUtils/CompatibleTypes.cpp.o
[ 0%] Building CXX object src/backends/backendsCommon/memoryOptimizerStrategyLibrary/test/CMakeFiles/armnnMemoryOptimizationStrategiesUnitTests.dir/ConstMemoryStrategyTests.cpp.o
cd /<<PKGBUILDDIR>>/build-area/src/backends/backendsCommon/memoryOptimizerStrategyLibrary && /usr/bin/c++ -DARMCOMPUTECL_ENABLED -DARMCOMPUTENEON_ENABLED -DARMNN_DYNAMIC_BACKEND_ENABLED -DARMNN_SERIALIZER -DARMNN_SERIALIZER_SCHEMA_PATH=\"/<<PKGBUILDDIR>>/src/armnnSerializer/ArmnnSchema.fbs\" -DARMNN_TF_LITE_PARSER -DDYNAMIC_BACKEND_BUILD_DIR=\"/<<PKGBUILDDIR>>/build-area\" -I/<<PKGBUILDDIR>>/include -I/<<PKGBUILDDIR>>/profiling -isystem /<<PKGBUILDDIR>>/third-party -g -O2 -ffile-prefix-map=/<<PKGBUILDDIR>>=. -fstack-protector-strong -fstack-clash-protection -Wformat -Werror=format-security -mbranch-protection=standard -Wdate-time -D_FORTIFY_SOURCE=2 -std=c++17 -Wall -Wextra -Werror -Wold-style-cast -Wno-missing-braces -Wconversion -Wsign-conversion -Wno-psabi -std=gnu++17 -fPIC '-DDYNAMIC_BACKEND_PATHS="/usr/lib/aarch64-linux-gnu/armnn33/"' -MD -MT src/backends/backendsCommon/memoryOptimizerStrategyLibrary/CMakeFiles/armnnMemoryOptimizationStrategies.dir/strategies/ConstantMemoryStrategy.cpp.o -MF CMakeFiles/armnnMemoryOptimizationStrategies.dir/strategies/ConstantMemoryStrategy.cpp.o.d -o CMakeFiles/armnnMemoryOptimizationStrategies.dir/strategies/ConstantMemoryStrategy.cpp.o -c /<<PKGBUILDDIR>>/src/backends/backendsCommon/memoryOptimizerStrategyLibrary/strategies/ConstantMemoryStrategy.cpp
[ 0%] Building CXX object tests/CMakeFiles/inferenceTest.dir/InferenceTest.cpp.o
/usr/bin/c++ -DARMCOMPUTECL_ENABLED -DARMCOMPUTENEON_ENABLED -DARMNN_DYNAMIC_BACKEND_ENABLED -DARMNN_SERIALIZER -DARMNN_SERIALIZER_SCHEMA_PATH=\"/<<PKGBUILDDIR>>/src/armnnSerializer/ArmnnSchema.fbs\" -DARMNN_TF_LITE_PARSER -DDYNAMIC_BACKEND_BUILD_DIR=\"/<<PKGBUILDDIR>>/build-area\" -I/<<PKGBUILDDIR>>/include -I/<<PKGBUILDDIR>>/profiling -I/<<PKGBUILDDIR>>/src/backends -isystem /<<PKGBUILDDIR>>/third-party -g -O2 -ffile-prefix-map=/<<PKGBUILDDIR>>=. -fstack-protector-strong -fstack-clash-protection -Wformat -Werror=format-security -mbranch-protection=standard -Wdate-time -D_FORTIFY_SOURCE=2 -std=c++17 -Wall -Wextra -Werror -Wold-style-cast -Wno-missing-braces -Wconversion -Wsign-conversion -Wno-psabi -std=gnu++17 -fPIC '-DDYNAMIC_BACKEND_PATHS="/usr/lib/aarch64-linux-gnu/armnn33/"' -MD -MT CMakeFiles/armnnUtils.dir/src/armnnUtils/CompatibleTypes.cpp.o -MF CMakeFiles/armnnUtils.dir/src/armnnUtils/CompatibleTypes.cpp.o.d -o CMakeFiles/armnnUtils.dir/src/armnnUtils/CompatibleTypes.cpp.o -c /<<PKGBUILDDIR>>/src/armnnUtils/CompatibleTypes.cpp
cd /<<PKGBUILDDIR>>/build-area/src/backends/backendsCommon/memoryOptimizerStrategyLibrary/test && /usr/bin/c++ -DARMCOMPUTECL_ENABLED -DARMCOMPUTENEON_ENABLED -DARMNN_DYNAMIC_BACKEND_ENABLED -DARMNN_SERIALIZER -DARMNN_SERIALIZER_SCHEMA_PATH=\"/<<PKGBUILDDIR>>/src/armnnSerializer/ArmnnSchema.fbs\" -DARMNN_TF_LITE_PARSER -DDYNAMIC_BACKEND_BUILD_DIR=\"/<<PKGBUILDDIR>>/build-area\" -I/<<PKGBUILDDIR>>/include -I/<<PKGBUILDDIR>>/profiling -I/<<PKGBUILDDIR>>/src/backends -isystem /<<PKGBUILDDIR>>/third-party -g -O2 -ffile-prefix-map=/<<PKGBUILDDIR>>=. -fstack-protector-strong -fstack-clash-protection -Wformat -Werror=format-security -mbranch-protection=standard -Wdate-time -D_FORTIFY_SOURCE=2 -std=c++17 -Wall -Wextra -Werror -Wold-style-cast -Wno-missing-braces -Wconversion -Wsign-conversion -Wno-psabi -std=gnu++17 -fPIC '-DDYNAMIC_BACKEND_PATHS="/usr/lib/aarch64-linux-gnu/armnn33/"' -MD -MT src/backends/backendsCommon/memoryOptimizerStrategyLibrary/test/CMakeFiles/armnnMemoryOptimizationStrategiesUnitTests.dir/ConstMemoryStrategyTests.cpp.o -MF CMakeFiles/armnnMemoryOptimizationStrategiesUnitTests.dir/ConstMemoryStrategyTests.cpp.o.d -o CMakeFiles/armnnMemoryOptimizationStrategiesUnitTests.dir/ConstMemoryStrategyTests.cpp.o -c /<<PKGBUILDDIR>>/src/backends/backendsCommon/memoryOptimizerStrategyLibrary/test/ConstMemoryStrategyTests.cpp
cd /<<PKGBUILDDIR>>/build-area/tests && /usr/bin/c++ -DARMCOMPUTECL_ENABLED -DARMCOMPUTENEON_ENABLED -DARMNN_DYNAMIC_BACKEND_ENABLED -DARMNN_SERIALIZER -DARMNN_SERIALIZER_SCHEMA_PATH=\"/<<PKGBUILDDIR>>/src/armnnSerializer/ArmnnSchema.fbs\" -DARMNN_TF_LITE_PARSER -DDYNAMIC_BACKEND_BUILD_DIR=\"/<<PKGBUILDDIR>>/build-area\" -I/<<PKGBUILDDIR>>/include -I/<<PKGBUILDDIR>>/profiling -I/<<PKGBUILDDIR>>/tests/../src/armnnUtils -I/<<PKGBUILDDIR>>/tests/../src/backends -I/<<PKGBUILDDIR>>/tests/../third-party/stb -isystem /<<PKGBUILDDIR>>/third-party -g -O2 -ffile-prefix-map=/<<PKGBUILDDIR>>=. -fstack-protector-strong -fstack-clash-protection -Wformat -Werror=format-security -mbranch-protection=standard -Wdate-time -D_FORTIFY_SOURCE=2 -std=c++17 -Wall -Wextra -Werror -Wold-style-cast -Wno-missing-braces -Wconversion -Wsign-conversion -Wno-psabi -std=gnu++17 -fPIC '-DDYNAMIC_BACKEND_PATHS="/usr/lib/aarch64-linux-gnu/armnn33/"' -MD -MT tests/CMakeFiles/inferenceTest.dir/InferenceTest.cpp.o -MF CMakeFiles/inferenceTest.dir/InferenceTest.cpp.o.d -o CMakeFiles/inferenceTest.dir/InferenceTest.cpp.o -c /<<PKGBUILDDIR>>/tests/InferenceTest.cpp
[ 0%] Building CXX object src/backends/aclCommon/CMakeFiles/armnnAclCommon.dir/ArmComputeTensorUtils.cpp.o
[ 0%] Building CXX object src/backends/backendsCommon/CMakeFiles/armnnBackendsCommon.dir/DynamicBackend.cpp.o
[ 1%] Building CXX object third-party/fmt/CMakeFiles/fmt.dir/src/format.cc.o
cd /<<PKGBUILDDIR>>/build-area && /usr/bin/cmake -E cmake_depends "Unix Makefiles" /<<PKGBUILDDIR>> /<<PKGBUILDDIR>>/src/armnnSerializer /<<PKGBUILDDIR>>/build-area /<<PKGBUILDDIR>>/build-area/src/armnnSerializer /<<PKGBUILDDIR>>/build-area/src/armnnSerializer/CMakeFiles/armnnSerializer-static.dir/DependInfo.cmake "--color="
cd /<<PKGBUILDDIR>>/build-area/src/backends/aclCommon && /usr/bin/c++ -DARMCOMPUTECL_ENABLED -DARMCOMPUTENEON_ENABLED -DARMNN_DYNAMIC_BACKEND_ENABLED -DARMNN_SERIALIZER -DARMNN_SERIALIZER_SCHEMA_PATH=\"/<<PKGBUILDDIR>>/src/armnnSerializer/ArmnnSchema.fbs\" -DARMNN_TF_LITE_PARSER -DDYNAMIC_BACKEND_BUILD_DIR=\"/<<PKGBUILDDIR>>/build-area\" -DarmnnAclCommon_EXPORTS -I/<<PKGBUILDDIR>>/include -I/<<PKGBUILDDIR>>/profiling -I/<<PKGBUILDDIR>>/src/armnn -I/<<PKGBUILDDIR>>/src/armnnUtils -I/<<PKGBUILDDIR>>/src/backends -I/<<PKGBUILDDIR>>/src/profiling -I/<<PKGBUILDDIR>>/profiling/common/include -I/<<PKGBUILDDIR>>/profiling/client/include -isystem /<<PKGBUILDDIR>>/third-party -g -O2 -ffile-prefix-map=/<<PKGBUILDDIR>>=. -fstack-protector-strong -fstack-clash-protection -Wformat -Werror=format-security -mbranch-protection=standard -Wdate-time -D_FORTIFY_SOURCE=2 -std=c++17 -Wall -Wextra -Werror -Wold-style-cast -Wno-missing-braces -Wconversion -Wsign-conversion -Wno-psabi -std=gnu++17 -fPIC '-DDYNAMIC_BACKEND_PATHS="/usr/lib/aarch64-linux-gnu/armnn33/"' -MD -MT src/backends/aclCommon/CMakeFiles/armnnAclCommon.dir/ArmComputeTensorUtils.cpp.o -MF CMakeFiles/armnnAclCommon.dir/ArmComputeTensorUtils.cpp.o.d -o CMakeFiles/armnnAclCommon.dir/ArmComputeTensorUtils.cpp.o -c /<<PKGBUILDDIR>>/src/backends/aclCommon/ArmComputeTensorUtils.cpp
cd /<<PKGBUILDDIR>>/build-area/src/backends/backendsCommon && /usr/bin/c++ -DARMCOMPUTECL_ENABLED -DARMCOMPUTENEON_ENABLED -DARMNN_DYNAMIC_BACKEND_ENABLED -DARMNN_SERIALIZER -DARMNN_SERIALIZER_SCHEMA_PATH=\"/<<PKGBUILDDIR>>/src/armnnSerializer/ArmnnSchema.fbs\" -DARMNN_TF_LITE_PARSER -DDYNAMIC_BACKEND_BUILD_DIR=\"/<<PKGBUILDDIR>>/build-area\" -I/<<PKGBUILDDIR>>/include -I/<<PKGBUILDDIR>>/profiling -I/<<PKGBUILDDIR>>/include/armnn/backends -I/<<PKGBUILDDIR>>/src/armnn -I/<<PKGBUILDDIR>>/src/armnnUtils -I/<<PKGBUILDDIR>>/src/backends -I/<<PKGBUILDDIR>>/src/profiling -I/<<PKGBUILDDIR>>/profiling/common/include -I/<<PKGBUILDDIR>>/profiling/client/include -isystem /<<PKGBUILDDIR>>/third-party -g -O2 -ffile-prefix-map=/<<PKGBUILDDIR>>=. -fstack-protector-strong -fstack-clash-protection -Wformat -Werror=format-security -mbranch-protection=standard -Wdate-time -D_FORTIFY_SOURCE=2 -std=c++17 -Wall -Wextra -Werror -Wold-style-cast -Wno-missing-braces -Wconversion -Wsign-conversion -Wno-psabi -std=gnu++17 -fPIC '-DDYNAMIC_BACKEND_PATHS="/usr/lib/aarch64-linux-gnu/armnn33/"' -MD -MT src/backends/backendsCommon/CMakeFiles/armnnBackendsCommon.dir/DynamicBackend.cpp.o -MF CMakeFiles/armnnBackendsCommon.dir/DynamicBackend.cpp.o.d -o CMakeFiles/armnnBackendsCommon.dir/DynamicBackend.cpp.o -c /<<PKGBUILDDIR>>/src/backends/backendsCommon/DynamicBackend.cpp
cd /<<PKGBUILDDIR>>/build-area/third-party/fmt && /usr/bin/c++ -DARMCOMPUTECL_ENABLED -DARMCOMPUTENEON_ENABLED -DARMNN_DYNAMIC_BACKEND_ENABLED -DARMNN_SERIALIZER -DARMNN_SERIALIZER_SCHEMA_PATH=\"/<<PKGBUILDDIR>>/src/armnnSerializer/ArmnnSchema.fbs\" -DARMNN_TF_LITE_PARSER -DDYNAMIC_BACKEND_BUILD_DIR=\"/<<PKGBUILDDIR>>/build-area\" -I/<<PKGBUILDDIR>>/include -I/<<PKGBUILDDIR>>/profiling -I/<<PKGBUILDDIR>>/third-party/fmt -isystem /<<PKGBUILDDIR>>/third-party -g -O2 -ffile-prefix-map=/<<PKGBUILDDIR>>=. -fstack-protector-strong -fstack-clash-protection -Wformat -Werror=format-security -mbranch-protection=standard -Wdate-time -D_FORTIFY_SOURCE=2 -std=c++17 -Wall -Wextra -Werror -Wold-style-cast -Wno-missing-braces -Wconversion -Wsign-conversion -Wno-psabi -std=gnu++17 -fPIC '-DDYNAMIC_BACKEND_PATHS="/usr/lib/aarch64-linux-gnu/armnn33/"' -MD -MT third-party/fmt/CMakeFiles/fmt.dir/src/format.cc.o -MF CMakeFiles/fmt.dir/src/format.cc.o.d -o CMakeFiles/fmt.dir/src/format.cc.o -c /<<PKGBUILDDIR>>/third-party/fmt/src/format.cc
make[3]: Leaving directory '/<<PKGBUILDDIR>>/build-area'
make -f src/armnnSerializer/CMakeFiles/armnnSerializer-static.dir/build.make src/armnnSerializer/CMakeFiles/armnnSerializer-static.dir/build
make[3]: Entering directory '/<<PKGBUILDDIR>>/build-area'
[ 1%] Building CXX object src/armnnSerializer/CMakeFiles/armnnSerializer-static.dir/Serializer.cpp.o
cd /<<PKGBUILDDIR>>/build-area/src/armnnSerializer && /usr/bin/c++ -DARMCOMPUTECL_ENABLED -DARMCOMPUTENEON_ENABLED -DARMNN_DYNAMIC_BACKEND_ENABLED -DARMNN_SERIALIZER -DARMNN_SERIALIZER_SCHEMA_PATH=\"/<<PKGBUILDDIR>>/src/armnnSerializer/ArmnnSchema.fbs\" -DARMNN_TF_LITE_PARSER -DDYNAMIC_BACKEND_BUILD_DIR=\"/<<PKGBUILDDIR>>/build-area\" -I/<<PKGBUILDDIR>>/include -I/<<PKGBUILDDIR>>/profiling -I/<<PKGBUILDDIR>>/src/armnnSerializer/../armnn -I/<<PKGBUILDDIR>>/src/armnnSerializer/../armnnUtils -I/<<PKGBUILDDIR>>/src/armnnSerializer/../../generated -isystem /<<PKGBUILDDIR>>/third-party -g -O2 -ffile-prefix-map=/<<PKGBUILDDIR>>=. -fstack-protector-strong -fstack-clash-protection -Wformat -Werror=format-security -mbranch-protection=standard -Wdate-time -D_FORTIFY_SOURCE=2 -std=c++17 -Wall -Wextra -Werror -Wold-style-cast -Wno-missing-braces -Wconversion -Wsign-conversion -Wno-psabi -std=gnu++17 -fPIC '-DDYNAMIC_BACKEND_PATHS="/usr/lib/aarch64-linux-gnu/armnn33/"' -MD -MT src/armnnSerializer/CMakeFiles/armnnSerializer-static.dir/Serializer.cpp.o -MF CMakeFiles/armnnSerializer-static.dir/Serializer.cpp.o.d -o CMakeFiles/armnnSerializer-static.dir/Serializer.cpp.o -c /<<PKGBUILDDIR>>/src/armnnSerializer/Serializer.cpp
[ 1%] Building CXX object src/backends/backendsCommon/memoryOptimizerStrategyLibrary/CMakeFiles/armnnMemoryOptimizationStrategies.dir/strategies/StrategyValidator.cpp.o
cd /<<PKGBUILDDIR>>/build-area/src/backends/backendsCommon/memoryOptimizerStrategyLibrary && /usr/bin/c++ -DARMCOMPUTECL_ENABLED -DARMCOMPUTENEON_ENABLED -DARMNN_DYNAMIC_BACKEND_ENABLED -DARMNN_SERIALIZER -DARMNN_SERIALIZER_SCHEMA_PATH=\"/<<PKGBUILDDIR>>/src/armnnSerializer/ArmnnSchema.fbs\" -DARMNN_TF_LITE_PARSER -DDYNAMIC_BACKEND_BUILD_DIR=\"/<<PKGBUILDDIR>>/build-area\" -I/<<PKGBUILDDIR>>/include -I/<<PKGBUILDDIR>>/profiling -isystem /<<PKGBUILDDIR>>/third-party -g -O2 -ffile-prefix-map=/<<PKGBUILDDIR>>=. -fstack-protector-strong -fstack-clash-protection -Wformat -Werror=format-security -mbranch-protection=standard -Wdate-time -D_FORTIFY_SOURCE=2 -std=c++17 -Wall -Wextra -Werror -Wold-style-cast -Wno-missing-braces -Wconversion -Wsign-conversion -Wno-psabi -std=gnu++17 -fPIC '-DDYNAMIC_BACKEND_PATHS="/usr/lib/aarch64-linux-gnu/armnn33/"' -MD -MT src/backends/backendsCommon/memoryOptimizerStrategyLibrary/CMakeFiles/armnnMemoryOptimizationStrategies.dir/strategies/StrategyValidator.cpp.o -MF CMakeFiles/armnnMemoryOptimizationStrategies.dir/strategies/StrategyValidator.cpp.o.d -o CMakeFiles/armnnMemoryOptimizationStrategies.dir/strategies/StrategyValidator.cpp.o -c /<<PKGBUILDDIR>>/src/backends/backendsCommon/memoryOptimizerStrategyLibrary/strategies/StrategyValidator.cpp
[ 1%] Building CXX object CMakeFiles/armnnUtils.dir/src/armnnUtils/Filesystem.cpp.o
/usr/bin/c++ -DARMCOMPUTECL_ENABLED -DARMCOMPUTENEON_ENABLED -DARMNN_DYNAMIC_BACKEND_ENABLED -DARMNN_SERIALIZER -DARMNN_SERIALIZER_SCHEMA_PATH=\"/<<PKGBUILDDIR>>/src/armnnSerializer/ArmnnSchema.fbs\" -DARMNN_TF_LITE_PARSER -DDYNAMIC_BACKEND_BUILD_DIR=\"/<<PKGBUILDDIR>>/build-area\" -I/<<PKGBUILDDIR>>/include -I/<<PKGBUILDDIR>>/profiling -I/<<PKGBUILDDIR>>/src/backends -isystem /<<PKGBUILDDIR>>/third-party -g -O2 -ffile-prefix-map=/<<PKGBUILDDIR>>=. -fstack-protector-strong -fstack-clash-protection -Wformat -Werror=format-security -mbranch-protection=standard -Wdate-time -D_FORTIFY_SOURCE=2 -std=c++17 -Wall -Wextra -Werror -Wold-style-cast -Wno-missing-braces -Wconversion -Wsign-conversion -Wno-psabi -std=gnu++17 -fPIC '-DDYNAMIC_BACKEND_PATHS="/usr/lib/aarch64-linux-gnu/armnn33/"' -MD -MT CMakeFiles/armnnUtils.dir/src/armnnUtils/Filesystem.cpp.o -MF CMakeFiles/armnnUtils.dir/src/armnnUtils/Filesystem.cpp.o.d -o CMakeFiles/armnnUtils.dir/src/armnnUtils/Filesystem.cpp.o -c /<<PKGBUILDDIR>>/src/armnnUtils/Filesystem.cpp
[ 1%] Building CXX object src/backends/backendsCommon/memoryOptimizerStrategyLibrary/test/CMakeFiles/armnnMemoryOptimizationStrategiesUnitTests.dir/ValidatorStrategyTests.cpp.o
cd /<<PKGBUILDDIR>>/build-area/src/backends/backendsCommon/memoryOptimizerStrategyLibrary/test && /usr/bin/c++ -DARMCOMPUTECL_ENABLED -DARMCOMPUTENEON_ENABLED -DARMNN_DYNAMIC_BACKEND_ENABLED -DARMNN_SERIALIZER -DARMNN_SERIALIZER_SCHEMA_PATH=\"/<<PKGBUILDDIR>>/src/armnnSerializer/ArmnnSchema.fbs\" -DARMNN_TF_LITE_PARSER -DDYNAMIC_BACKEND_BUILD_DIR=\"/<<PKGBUILDDIR>>/build-area\" -I/<<PKGBUILDDIR>>/include -I/<<PKGBUILDDIR>>/profiling -I/<<PKGBUILDDIR>>/src/backends -isystem /<<PKGBUILDDIR>>/third-party -g -O2 -ffile-prefix-map=/<<PKGBUILDDIR>>=. -fstack-protector-strong -fstack-clash-protection -Wformat -Werror=format-security -mbranch-protection=standard -Wdate-time -D_FORTIFY_SOURCE=2 -std=c++17 -Wall -Wextra -Werror -Wold-style-cast -Wno-missing-braces -Wconversion -Wsign-conversion -Wno-psabi -std=gnu++17 -fPIC '-DDYNAMIC_BACKEND_PATHS="/usr/lib/aarch64-linux-gnu/armnn33/"' -MD -MT src/backends/backendsCommon/memoryOptimizerStrategyLibrary/test/CMakeFiles/armnnMemoryOptimizationStrategiesUnitTests.dir/ValidatorStrategyTests.cpp.o -MF CMakeFiles/armnnMemoryOptimizationStrategiesUnitTests.dir/ValidatorStrategyTests.cpp.o.d -o CMakeFiles/armnnMemoryOptimizationStrategiesUnitTests.dir/ValidatorStrategyTests.cpp.o -c /<<PKGBUILDDIR>>/src/backends/backendsCommon/memoryOptimizerStrategyLibrary/test/ValidatorStrategyTests.cpp
[ 1%] Building CXX object src/backends/backendsCommon/CMakeFiles/armnnBackendsCommon.dir/DynamicBackendUtils.cpp.o
cd /<<PKGBUILDDIR>>/build-area/src/backends/backendsCommon && /usr/bin/c++ -DARMCOMPUTECL_ENABLED -DARMCOMPUTENEON_ENABLED -DARMNN_DYNAMIC_BACKEND_ENABLED -DARMNN_SERIALIZER -DARMNN_SERIALIZER_SCHEMA_PATH=\"/<<PKGBUILDDIR>>/src/armnnSerializer/ArmnnSchema.fbs\" -DARMNN_TF_LITE_PARSER -DDYNAMIC_BACKEND_BUILD_DIR=\"/<<PKGBUILDDIR>>/build-area\" -I/<<PKGBUILDDIR>>/include -I/<<PKGBUILDDIR>>/profiling -I/<<PKGBUILDDIR>>/include/armnn/backends -I/<<PKGBUILDDIR>>/src/armnn -I/<<PKGBUILDDIR>>/src/armnnUtils -I/<<PKGBUILDDIR>>/src/backends -I/<<PKGBUILDDIR>>/src/profiling -I/<<PKGBUILDDIR>>/profiling/common/include -I/<<PKGBUILDDIR>>/profiling/client/include -isystem /<<PKGBUILDDIR>>/third-party -g -O2 -ffile-prefix-map=/<<PKGBUILDDIR>>=. -fstack-protector-strong -fstack-clash-protection -Wformat -Werror=format-security -mbranch-protection=standard -Wdate-time -D_FORTIFY_SOURCE=2 -std=c++17 -Wall -Wextra -Werror -Wold-style-cast -Wno-missing-braces -Wconversion -Wsign-conversion -Wno-psabi -std=gnu++17 -fPIC '-DDYNAMIC_BACKEND_PATHS="/usr/lib/aarch64-linux-gnu/armnn33/"' -MD -MT src/backends/backendsCommon/CMakeFiles/armnnBackendsCommon.dir/DynamicBackendUtils.cpp.o -MF CMakeFiles/armnnBackendsCommon.dir/DynamicBackendUtils.cpp.o.d -o CMakeFiles/armnnBackendsCommon.dir/DynamicBackendUtils.cpp.o -c /<<PKGBUILDDIR>>/src/backends/backendsCommon/DynamicBackendUtils.cpp
[ 2%] Building CXX object src/backends/backendsCommon/memoryOptimizerStrategyLibrary/CMakeFiles/armnnMemoryOptimizationStrategies.dir/strategies/SingleAxisPriorityList.cpp.o
cd /<<PKGBUILDDIR>>/build-area/src/backends/backendsCommon/memoryOptimizerStrategyLibrary && /usr/bin/c++ -DARMCOMPUTECL_ENABLED -DARMCOMPUTENEON_ENABLED -DARMNN_DYNAMIC_BACKEND_ENABLED -DARMNN_SERIALIZER -DARMNN_SERIALIZER_SCHEMA_PATH=\"/<<PKGBUILDDIR>>/src/armnnSerializer/ArmnnSchema.fbs\" -DARMNN_TF_LITE_PARSER -DDYNAMIC_BACKEND_BUILD_DIR=\"/<<PKGBUILDDIR>>/build-area\" -I/<<PKGBUILDDIR>>/include -I/<<PKGBUILDDIR>>/profiling -isystem /<<PKGBUILDDIR>>/third-party -g -O2 -ffile-prefix-map=/<<PKGBUILDDIR>>=. -fstack-protector-strong -fstack-clash-protection -Wformat -Werror=format-security -mbranch-protection=standard -Wdate-time -D_FORTIFY_SOURCE=2 -std=c++17 -Wall -Wextra -Werror -Wold-style-cast -Wno-missing-braces -Wconversion -Wsign-conversion -Wno-psabi -std=gnu++17 -fPIC '-DDYNAMIC_BACKEND_PATHS="/usr/lib/aarch64-linux-gnu/armnn33/"' -MD -MT src/backends/backendsCommon/memoryOptimizerStrategyLibrary/CMakeFiles/armnnMemoryOptimizationStrategies.dir/strategies/SingleAxisPriorityList.cpp.o -MF CMakeFiles/armnnMemoryOptimizationStrategies.dir/strategies/SingleAxisPriorityList.cpp.o.d -o CMakeFiles/armnnMemoryOptimizationStrategies.dir/strategies/SingleAxisPriorityList.cpp.o -c /<<PKGBUILDDIR>>/src/backends/backendsCommon/memoryOptimizerStrategyLibrary/strategies/SingleAxisPriorityList.cpp
In file included from /usr/include/c++/14/string:51,
from /usr/include/c++/14/bits/locale_classes.h:40,
from /usr/include/c++/14/bits/ios_base.h:41,
from /usr/include/c++/14/ios:44,
from /usr/include/c++/14/istream:40,
from /usr/include/c++/14/sstream:40,
from /<<PKGBUILDDIR>>/include/armnn/Exceptions.hpp:7,
from /<<PKGBUILDDIR>>/include/armnn/Tensor.hpp:7,
from /<<PKGBUILDDIR>>/src/backends/aclCommon/ArmComputeTensorUtils.hpp:7,
from /<<PKGBUILDDIR>>/src/backends/aclCommon/ArmComputeTensorUtils.cpp:5:
In static member function ‘static _Up* std::__copy_move<_IsMove, true, std::random_access_iterator_tag>::__copy_m(_Tp*, _Tp*, _Up*) [with _Tp = const int; _Up = int; bool _IsMove = false]’,
inlined from ‘_OI std::__copy_move_a2(_II, _II, _OI) [with bool _IsMove = false; _II = const int*; _OI = int*]’ at /usr/include/c++/14/bits/stl_algobase.h:521:30,
inlined from ‘_OI std::__copy_move_a1(_II, _II, _OI) [with bool _IsMove = false; _II = const int*; _OI = int*]’ at /usr/include/c++/14/bits/stl_algobase.h:548:42,
inlined from ‘_OI std::__copy_move_a(_II, _II, _OI) [with bool _IsMove = false; _II = __gnu_cxx::__normal_iterator<const int*, vector<int> >; _OI = int*]’ at /usr/include/c++/14/bits/stl_algobase.h:555:31,
inlined from ‘_OI std::copy(_II, _II, _OI) [with _II = __gnu_cxx::__normal_iterator<const int*, vector<int> >; _OI = int*]’ at /usr/include/c++/14/bits/stl_algobase.h:651:7,
inlined from ‘static _ForwardIterator std::__uninitialized_copy<true>::__uninit_copy(_InputIterator, _InputIterator, _ForwardIterator) [with _InputIterator = __gnu_cxx::__normal_iterator<const int*, std::vector<int> >; _ForwardIterator = int*]’ at /usr/include/c++/14/bits/stl_uninitialized.h:147:27,
inlined from ‘_ForwardIterator std::uninitialized_copy(_InputIterator, _InputIterator, _ForwardIterator) [with _InputIterator = __gnu_cxx::__normal_iterator<const int*, vector<int> >; _ForwardIterator = int*]’ at /usr/include/c++/14/bits/stl_uninitialized.h:185:15,
inlined from ‘_ForwardIterator std::__uninitialized_copy_a(_InputIterator, _InputIterator, _ForwardIterator, allocator<_Tp>&) [with _InputIterator = __gnu_cxx::__normal_iterator<const int*, vector<int> >; _ForwardIterator = int*; _Tp = int]’ at /usr/include/c++/14/bits/stl_uninitialized.h:373:37,
inlined from ‘std::vector<_Tp, _Alloc>::vector(const std::vector<_Tp, _Alloc>&) [with _Tp = int; _Alloc = std::allocator<int>]’ at /usr/include/c++/14/bits/stl_vector.h:606:31,
inlined from ‘arm_compute::QuantizationInfo::QuantizationInfo(const arm_compute::QuantizationInfo&)’ at /usr/include/aarch64-linux-gnu/arm_compute/core/QuantizationInfo.h:68:7,
inlined from ‘arm_compute::TensorInfo armnn::armcomputetensorutils::BuildArmComputeTensorInfo(const armnn::TensorInfo&)’ at /<<PKGBUILDDIR>>/src/backends/aclCommon/ArmComputeTensorUtils.cpp:210:87:
/usr/include/c++/14/bits/stl_algobase.h:452:30: error: ‘void* __builtin_memcpy(void*, const void*, long unsigned int)’ forming offset 4 is out of the bounds [0, 4] [-Werror=array-bounds=]
452 | __builtin_memmove(__result, __first, sizeof(_Tp) * _Num);
| ~~~~~~~~~~~~~~~~~^~~~~~~~~~~~~~~~~~~~~~~~~~~~~~~~~~~~~~~
In static member function ‘static _Up* std::__copy_move<_IsMove, true, std::random_access_iterator_tag>::__copy_m(_Tp*, _Tp*, _Up*) [with _Tp = const int; _Up = int; bool _IsMove = false]’,
inlined from ‘_OI std::__copy_move_a2(_II, _II, _OI) [with bool _IsMove = false; _II = const int*; _OI = int*]’ at /usr/include/c++/14/bits/stl_algobase.h:521:30,
inlined from ‘_OI std::__copy_move_a1(_II, _II, _OI) [with bool _IsMove = false; _II = const int*; _OI = int*]’ at /usr/include/c++/14/bits/stl_algobase.h:548:42,
inlined from ‘_OI std::__copy_move_a(_II, _II, _OI) [with bool _IsMove = false; _II = __gnu_cxx::__normal_iterator<const int*, vector<int> >; _OI = int*]’ at /usr/include/c++/14/bits/stl_algobase.h:555:31,
inlined from ‘_OI std::copy(_II, _II, _OI) [with _II = __gnu_cxx::__normal_iterator<const int*, vector<int> >; _OI = int*]’ at /usr/include/c++/14/bits/stl_algobase.h:651:7,
inlined from ‘static _ForwardIterator std::__uninitialized_copy<true>::__uninit_copy(_InputIterator, _InputIterator, _ForwardIterator) [with _InputIterator = __gnu_cxx::__normal_iterator<const int*, std::vector<int> >; _ForwardIterator = int*]’ at /usr/include/c++/14/bits/stl_uninitialized.h:147:27,
inlined from ‘_ForwardIterator std::uninitialized_copy(_InputIterator, _InputIterator, _ForwardIterator) [with _InputIterator = __gnu_cxx::__normal_iterator<const int*, vector<int> >; _ForwardIterator = int*]’ at /usr/include/c++/14/bits/stl_uninitialized.h:185:15,
inlined from ‘_ForwardIterator std::__uninitialized_copy_a(_InputIterator, _InputIterator, _ForwardIterator, allocator<_Tp>&) [with _InputIterator = __gnu_cxx::__normal_iterator<const int*, vector<int> >; _ForwardIterator = int*; _Tp = int]’ at /usr/include/c++/14/bits/stl_uninitialized.h:373:37,
inlined from ‘std::vector<_Tp, _Alloc>::vector(const std::vector<_Tp, _Alloc>&) [with _Tp = int; _Alloc = std::allocator<int>]’ at /usr/include/c++/14/bits/stl_vector.h:606:31,
inlined from ‘arm_compute::QuantizationInfo::QuantizationInfo(const arm_compute::QuantizationInfo&)’ at /usr/include/aarch64-linux-gnu/arm_compute/core/QuantizationInfo.h:68:7,
inlined from ‘arm_compute::TensorInfo armnn::armcomputetensorutils::BuildArmComputeTensorInfo(const armnn::TensorInfo&, unsigned int)’ at /<<PKGBUILDDIR>>/src/backends/aclCommon/ArmComputeTensorUtils.cpp:232:87:
/usr/include/c++/14/bits/stl_algobase.h:452:30: error: ‘void* __builtin_memcpy(void*, const void*, long unsigned int)’ forming offset 4 is out of the bounds [0, 4] [-Werror=array-bounds=]
452 | __builtin_memmove(__result, __first, sizeof(_Tp) * _Num);
| ~~~~~~~~~~~~~~~~~^~~~~~~~~~~~~~~~~~~~~~~~~~~~~~~~~~~~~~~
[ 2%] Building CXX object CMakeFiles/armnnUtils.dir/src/armnnUtils/Permute.cpp.o
/usr/bin/c++ -DARMCOMPUTECL_ENABLED -DARMCOMPUTENEON_ENABLED -DARMNN_DYNAMIC_BACKEND_ENABLED -DARMNN_SERIALIZER -DARMNN_SERIALIZER_SCHEMA_PATH=\"/<<PKGBUILDDIR>>/src/armnnSerializer/ArmnnSchema.fbs\" -DARMNN_TF_LITE_PARSER -DDYNAMIC_BACKEND_BUILD_DIR=\"/<<PKGBUILDDIR>>/build-area\" -I/<<PKGBUILDDIR>>/include -I/<<PKGBUILDDIR>>/profiling -I/<<PKGBUILDDIR>>/src/backends -isystem /<<PKGBUILDDIR>>/third-party -g -O2 -ffile-prefix-map=/<<PKGBUILDDIR>>=. -fstack-protector-strong -fstack-clash-protection -Wformat -Werror=format-security -mbranch-protection=standard -Wdate-time -D_FORTIFY_SOURCE=2 -std=c++17 -Wall -Wextra -Werror -Wold-style-cast -Wno-missing-braces -Wconversion -Wsign-conversion -Wno-psabi -std=gnu++17 -fPIC '-DDYNAMIC_BACKEND_PATHS="/usr/lib/aarch64-linux-gnu/armnn33/"' -MD -MT CMakeFiles/armnnUtils.dir/src/armnnUtils/Permute.cpp.o -MF CMakeFiles/armnnUtils.dir/src/armnnUtils/Permute.cpp.o.d -o CMakeFiles/armnnUtils.dir/src/armnnUtils/Permute.cpp.o -c /<<PKGBUILDDIR>>/src/armnnUtils/Permute.cpp
cc1plus: all warnings being treated as errors
make[3]: *** [src/backends/aclCommon/CMakeFiles/armnnAclCommon.dir/build.make:82: src/backends/aclCommon/CMakeFiles/armnnAclCommon.dir/ArmComputeTensorUtils.cpp.o] Error 1
make[3]: Leaving directory '/<<PKGBUILDDIR>>/build-area'
make[2]: *** [CMakeFiles/Makefile2:1559: src/backends/aclCommon/CMakeFiles/armnnAclCommon.dir/all] Error 2
make[2]: *** Waiting for unfinished jobs....
[ 2%] Building CXX object src/backends/backendsCommon/CMakeFiles/armnnBackendsCommon.dir/IBackendInternal.cpp.o
cd /<<PKGBUILDDIR>>/build-area/src/backends/backendsCommon && /usr/bin/c++ -DARMCOMPUTECL_ENABLED -DARMCOMPUTENEON_ENABLED -DARMNN_DYNAMIC_BACKEND_ENABLED -DARMNN_SERIALIZER -DARMNN_SERIALIZER_SCHEMA_PATH=\"/<<PKGBUILDDIR>>/src/armnnSerializer/ArmnnSchema.fbs\" -DARMNN_TF_LITE_PARSER -DDYNAMIC_BACKEND_BUILD_DIR=\"/<<PKGBUILDDIR>>/build-area\" -I/<<PKGBUILDDIR>>/include -I/<<PKGBUILDDIR>>/profiling -I/<<PKGBUILDDIR>>/include/armnn/backends -I/<<PKGBUILDDIR>>/src/armnn -I/<<PKGBUILDDIR>>/src/armnnUtils -I/<<PKGBUILDDIR>>/src/backends -I/<<PKGBUILDDIR>>/src/profiling -I/<<PKGBUILDDIR>>/profiling/common/include -I/<<PKGBUILDDIR>>/profiling/client/include -isystem /<<PKGBUILDDIR>>/third-party -g -O2 -ffile-prefix-map=/<<PKGBUILDDIR>>=. -fstack-protector-strong -fstack-clash-protection -Wformat -Werror=format-security -mbranch-protection=standard -Wdate-time -D_FORTIFY_SOURCE=2 -std=c++17 -Wall -Wextra -Werror -Wold-style-cast -Wno-missing-braces -Wconversion -Wsign-conversion -Wno-psabi -std=gnu++17 -fPIC '-DDYNAMIC_BACKEND_PATHS="/usr/lib/aarch64-linux-gnu/armnn33/"' -MD -MT src/backends/backendsCommon/CMakeFiles/armnnBackendsCommon.dir/IBackendInternal.cpp.o -MF CMakeFiles/armnnBackendsCommon.dir/IBackendInternal.cpp.o.d -o CMakeFiles/armnnBackendsCommon.dir/IBackendInternal.cpp.o -c /<<PKGBUILDDIR>>/src/backends/backendsCommon/IBackendInternal.cpp
make[3]: Leaving directory '/<<PKGBUILDDIR>>/build-area'
[ 2%] Built target armnnMemoryOptimizationStrategies
[ 2%] Building CXX object src/backends/backendsCommon/memoryOptimizerStrategyLibrary/test/CMakeFiles/armnnMemoryOptimizationStrategiesUnitTests.dir/SingleAxisPriorityListTests.cpp.o
cd /<<PKGBUILDDIR>>/build-area/src/backends/backendsCommon/memoryOptimizerStrategyLibrary/test && /usr/bin/c++ -DARMCOMPUTECL_ENABLED -DARMCOMPUTENEON_ENABLED -DARMNN_DYNAMIC_BACKEND_ENABLED -DARMNN_SERIALIZER -DARMNN_SERIALIZER_SCHEMA_PATH=\"/<<PKGBUILDDIR>>/src/armnnSerializer/ArmnnSchema.fbs\" -DARMNN_TF_LITE_PARSER -DDYNAMIC_BACKEND_BUILD_DIR=\"/<<PKGBUILDDIR>>/build-area\" -I/<<PKGBUILDDIR>>/include -I/<<PKGBUILDDIR>>/profiling -I/<<PKGBUILDDIR>>/src/backends -isystem /<<PKGBUILDDIR>>/third-party -g -O2 -ffile-prefix-map=/<<PKGBUILDDIR>>=. -fstack-protector-strong -fstack-clash-protection -Wformat -Werror=format-security -mbranch-protection=standard -Wdate-time -D_FORTIFY_SOURCE=2 -std=c++17 -Wall -Wextra -Werror -Wold-style-cast -Wno-missing-braces -Wconversion -Wsign-conversion -Wno-psabi -std=gnu++17 -fPIC '-DDYNAMIC_BACKEND_PATHS="/usr/lib/aarch64-linux-gnu/armnn33/"' -MD -MT src/backends/backendsCommon/memoryOptimizerStrategyLibrary/test/CMakeFiles/armnnMemoryOptimizationStrategiesUnitTests.dir/SingleAxisPriorityListTests.cpp.o -MF CMakeFiles/armnnMemoryOptimizationStrategiesUnitTests.dir/SingleAxisPriorityListTests.cpp.o.d -o CMakeFiles/armnnMemoryOptimizationStrategiesUnitTests.dir/SingleAxisPriorityListTests.cpp.o -c /<<PKGBUILDDIR>>/src/backends/backendsCommon/memoryOptimizerStrategyLibrary/test/SingleAxisPriorityListTests.cpp
[ 2%] Building CXX object src/backends/backendsCommon/memoryOptimizerStrategyLibrary/test/CMakeFiles/armnnMemoryOptimizationStrategiesUnitTests.dir/MemoryOptimizerStrategyLibraryTests.cpp.o
cd /<<PKGBUILDDIR>>/build-area/src/backends/backendsCommon/memoryOptimizerStrategyLibrary/test && /usr/bin/c++ -DARMCOMPUTECL_ENABLED -DARMCOMPUTENEON_ENABLED -DARMNN_DYNAMIC_BACKEND_ENABLED -DARMNN_SERIALIZER -DARMNN_SERIALIZER_SCHEMA_PATH=\"/<<PKGBUILDDIR>>/src/armnnSerializer/ArmnnSchema.fbs\" -DARMNN_TF_LITE_PARSER -DDYNAMIC_BACKEND_BUILD_DIR=\"/<<PKGBUILDDIR>>/build-area\" -I/<<PKGBUILDDIR>>/include -I/<<PKGBUILDDIR>>/profiling -I/<<PKGBUILDDIR>>/src/backends -isystem /<<PKGBUILDDIR>>/third-party -g -O2 -ffile-prefix-map=/<<PKGBUILDDIR>>=. -fstack-protector-strong -fstack-clash-protection -Wformat -Werror=format-security -mbranch-protection=standard -Wdate-time -D_FORTIFY_SOURCE=2 -std=c++17 -Wall -Wextra -Werror -Wold-style-cast -Wno-missing-braces -Wconversion -Wsign-conversion -Wno-psabi -std=gnu++17 -fPIC '-DDYNAMIC_BACKEND_PATHS="/usr/lib/aarch64-linux-gnu/armnn33/"' -MD -MT src/backends/backendsCommon/memoryOptimizerStrategyLibrary/test/CMakeFiles/armnnMemoryOptimizationStrategiesUnitTests.dir/MemoryOptimizerStrategyLibraryTests.cpp.o -MF CMakeFiles/armnnMemoryOptimizationStrategiesUnitTests.dir/MemoryOptimizerStrategyLibraryTests.cpp.o.d -o CMakeFiles/armnnMemoryOptimizationStrategiesUnitTests.dir/MemoryOptimizerStrategyLibraryTests.cpp.o -c /<<PKGBUILDDIR>>/src/backends/backendsCommon/memoryOptimizerStrategyLibrary/test/MemoryOptimizerStrategyLibraryTests.cpp
In file included from /<<PKGBUILDDIR>>/include/armnn/Types.hpp:7,
from /<<PKGBUILDDIR>>/include/armnn/Tensor.hpp:9,
from /<<PKGBUILDDIR>>/src/armnnUtils/Permute.cpp:6:
In member function ‘constexpr std::array<_Tp, _Nm>::value_type& std::array<_Tp, _Nm>::operator[](size_type) [with _Tp = unsigned int; long unsigned int _Nm = 5]’,
inlined from ‘void {anonymous}::PermuteLoop::Unroll(size_type, const unsigned char*, unsigned char*, const unsigned char*, unsigned char*, size_t)’ at /<<PKGBUILDDIR>>/src/armnnUtils/Permute.cpp:82:50,
inlined from ‘void {anonymous}::PermuteLoop::Unroll(size_type, const unsigned char*, unsigned char*, const unsigned char*, unsigned char*, size_t)’ at /<<PKGBUILDDIR>>/src/armnnUtils/Permute.cpp:80:23,
inlined from ‘void {anonymous}::PermuteLoop::Unroll(size_type, const unsigned char*, unsigned char*, const unsigned char*, unsigned char*, size_t)’ at /<<PKGBUILDDIR>>/src/armnnUtils/Permute.cpp:80:23,
inlined from ‘void {anonymous}::PermuteLoop::Unroll(size_type, const unsigned char*, unsigned char*, const unsigned char*, unsigned char*, size_t)’ at /<<PKGBUILDDIR>>/src/armnnUtils/Permute.cpp:80:23,
inlined from ‘void {anonymous}::PermuteLoop::Unroll(size_type, const unsigned char*, unsigned char*, const unsigned char*, unsigned char*, size_t)’ at /<<PKGBUILDDIR>>/src/armnnUtils/Permute.cpp:80:23,
inlined from ‘void {anonymous}::PermuteLoop::Unroll(size_type, const unsigned char*, unsigned char*, const unsigned char*, unsigned char*, size_t)’ at /<<PKGBUILDDIR>>/src/armnnUtils/Permute.cpp:80:23,
inlined from ‘void {anonymous}::PermuteLoop::Unroll(size_type, const unsigned char*, unsigned char*, const unsigned char*, unsigned char*, size_t)’ at /<<PKGBUILDDIR>>/src/armnnUtils/Permute.cpp:80:23:
/usr/include/c++/14/array:209:24: error: array subscript 6 is above array bounds of ‘std::__array_traits<unsigned int, 5>::_Type’ {aka ‘unsigned int [5]’} [-Werror=array-bounds=]
209 | return _M_elems[__n];
| ~~~~~~~~^
/usr/include/c++/14/array: In member function ‘void {anonymous}::PermuteLoop::Unroll(size_type, const unsigned char*, unsigned char*, const unsigned char*, unsigned char*, size_t)’:
/usr/include/c++/14/array:115:55: note: while referencing ‘std::array<unsigned int, 5>::_M_elems’
115 | typename __array_traits<_Tp, _Nm>::_Type _M_elems;
| ^~~~~~~~
In member function ‘constexpr std::array<_Tp, _Nm>::value_type& std::array<_Tp, _Nm>::operator[](size_type) [with _Tp = unsigned int; long unsigned int _Nm = 5]’,
inlined from ‘void {anonymous}::PermuteLoop::Unroll(size_type, const unsigned char*, unsigned char*, const unsigned char*, unsigned char*, size_t)’ at /<<PKGBUILDDIR>>/src/armnnUtils/Permute.cpp:83:50,
inlined from ‘void {anonymous}::PermuteLoop::Unroll(size_type, const unsigned char*, unsigned char*, const unsigned char*, unsigned char*, size_t)’ at /<<PKGBUILDDIR>>/src/armnnUtils/Permute.cpp:80:23,
inlined from ‘void {anonymous}::PermuteLoop::Unroll(size_type, const unsigned char*, unsigned char*, const unsigned char*, unsigned char*, size_t)’ at /<<PKGBUILDDIR>>/src/armnnUtils/Permute.cpp:80:23,
inlined from ‘void {anonymous}::PermuteLoop::Unroll(size_type, const unsigned char*, unsigned char*, const unsigned char*, unsigned char*, size_t)’ at /<<PKGBUILDDIR>>/src/armnnUtils/Permute.cpp:80:23,
inlined from ‘void {anonymous}::PermuteLoop::Unroll(size_type, const unsigned char*, unsigned char*, const unsigned char*, unsigned char*, size_t)’ at /<<PKGBUILDDIR>>/src/armnnUtils/Permute.cpp:80:23,
inlined from ‘void {anonymous}::PermuteLoop::Unroll(size_type, const unsigned char*, unsigned char*, const unsigned char*, unsigned char*, size_t)’ at /<<PKGBUILDDIR>>/src/armnnUtils/Permute.cpp:80:23,
inlined from ‘void {anonymous}::PermuteLoop::Unroll(size_type, const unsigned char*, unsigned char*, const unsigned char*, unsigned char*, size_t)’ at /<<PKGBUILDDIR>>/src/armnnUtils/Permute.cpp:80:23:
/usr/include/c++/14/array:209:24: error: array subscript 6 is above array bounds of ‘std::__array_traits<unsigned int, 5>::_Type’ {aka ‘unsigned int [5]’} [-Werror=array-bounds=]
209 | return _M_elems[__n];
| ~~~~~~~~^
/usr/include/c++/14/array: In member function ‘void {anonymous}::PermuteLoop::Unroll(size_type, const unsigned char*, unsigned char*, const unsigned char*, unsigned char*, size_t)’:
/usr/include/c++/14/array:115:55: note: while referencing ‘std::array<unsigned int, 5>::_M_elems’
115 | typename __array_traits<_Tp, _Nm>::_Type _M_elems;
| ^~~~~~~~
In member function ‘constexpr std::array<_Tp, _Nm>::value_type& std::array<_Tp, _Nm>::operator[](size_type) [with _Tp = unsigned int; long unsigned int _Nm = 5]’,
inlined from ‘void {anonymous}::PermuteLoop::Unroll(size_type, const unsigned char*, unsigned char*, const unsigned char*, unsigned char*, size_t)’ at /<<PKGBUILDDIR>>/src/armnnUtils/Permute.cpp:82:50,
inlined from ‘void {anonymous}::PermuteLoop::Unroll(size_type, const unsigned char*, unsigned char*, const unsigned char*, unsigned char*, size_t)’ at /<<PKGBUILDDIR>>/src/armnnUtils/Permute.cpp:80:23,
inlined from ‘void {anonymous}::PermuteLoop::Unroll(size_type, const unsigned char*, unsigned char*, const unsigned char*, unsigned char*, size_t)’ at /<<PKGBUILDDIR>>/src/armnnUtils/Permute.cpp:80:23,
inlined from ‘void {anonymous}::PermuteLoop::Unroll(size_type, const unsigned char*, unsigned char*, const unsigned char*, unsigned char*, size_t)’ at /<<PKGBUILDDIR>>/src/armnnUtils/Permute.cpp:80:23,
inlined from ‘void {anonymous}::PermuteLoop::Unroll(size_type, const unsigned char*, unsigned char*, const unsigned char*, unsigned char*, size_t)’ at /<<PKGBUILDDIR>>/src/armnnUtils/Permute.cpp:80:23,
inlined from ‘void {anonymous}::PermuteLoop::Unroll(size_type, const unsigned char*, unsigned char*, const unsigned char*, unsigned char*, size_t)’ at /<<PKGBUILDDIR>>/src/armnnUtils/Permute.cpp:80:23:
/usr/include/c++/14/array:209:24: error: array subscript 5 is above array bounds of ‘std::__array_traits<unsigned int, 5>::_Type’ {aka ‘unsigned int [5]’} [-Werror=array-bounds=]
209 | return _M_elems[__n];
| ~~~~~~~~^
/usr/include/c++/14/array: In member function ‘void {anonymous}::PermuteLoop::Unroll(size_type, const unsigned char*, unsigned char*, const unsigned char*, unsigned char*, size_t)’:
/usr/include/c++/14/array:115:55: note: while referencing ‘std::array<unsigned int, 5>::_M_elems’
115 | typename __array_traits<_Tp, _Nm>::_Type _M_elems;
| ^~~~~~~~
In member function ‘constexpr std::array<_Tp, _Nm>::value_type& std::array<_Tp, _Nm>::operator[](size_type) [with _Tp = unsigned int; long unsigned int _Nm = 5]’,
inlined from ‘void {anonymous}::PermuteLoop::Unroll(size_type, const unsigned char*, unsigned char*, const unsigned char*, unsigned char*, size_t)’ at /<<PKGBUILDDIR>>/src/armnnUtils/Permute.cpp:83:50,
inlined from ‘void {anonymous}::PermuteLoop::Unroll(size_type, const unsigned char*, unsigned char*, const unsigned char*, unsigned char*, size_t)’ at /<<PKGBUILDDIR>>/src/armnnUtils/Permute.cpp:80:23,
inlined from ‘void {anonymous}::PermuteLoop::Unroll(size_type, const unsigned char*, unsigned char*, const unsigned char*, unsigned char*, size_t)’ at /<<PKGBUILDDIR>>/src/armnnUtils/Permute.cpp:80:23,
inlined from ‘void {anonymous}::PermuteLoop::Unroll(size_type, const unsigned char*, unsigned char*, const unsigned char*, unsigned char*, size_t)’ at /<<PKGBUILDDIR>>/src/armnnUtils/Permute.cpp:80:23,
inlined from ‘void {anonymous}::PermuteLoop::Unroll(size_type, const unsigned char*, unsigned char*, const unsigned char*, unsigned char*, size_t)’ at /<<PKGBUILDDIR>>/src/armnnUtils/Permute.cpp:80:23,
inlined from ‘void {anonymous}::PermuteLoop::Unroll(size_type, const unsigned char*, unsigned char*, const unsigned char*, unsigned char*, size_t)’ at /<<PKGBUILDDIR>>/src/armnnUtils/Permute.cpp:80:23:
/usr/include/c++/14/array:209:24: error: array subscript 5 is above array bounds of ‘std::__array_traits<unsigned int, 5>::_Type’ {aka ‘unsigned int [5]’} [-Werror=array-bounds=]
209 | return _M_elems[__n];
| ~~~~~~~~^
/usr/include/c++/14/array: In member function ‘void {anonymous}::PermuteLoop::Unroll(size_type, const unsigned char*, unsigned char*, const unsigned char*, unsigned char*, size_t)’:
/usr/include/c++/14/array:115:55: note: while referencing ‘std::array<unsigned int, 5>::_M_elems’
115 | typename __array_traits<_Tp, _Nm>::_Type _M_elems;
| ^~~~~~~~
cc1plus: all warnings being treated as errors
make[3]: *** [CMakeFiles/armnnUtils.dir/build.make:110: CMakeFiles/armnnUtils.dir/src/armnnUtils/Permute.cpp.o] Error 1
make[3]: Leaving directory '/<<PKGBUILDDIR>>/build-area'
make[2]: *** [CMakeFiles/Makefile2:740: CMakeFiles/armnnUtils.dir/all] Error 2
[ 2%] Building CXX object src/backends/backendsCommon/CMakeFiles/armnnBackendsCommon.dir/ITensorHandleFactory.cpp.o
cd /<<PKGBUILDDIR>>/build-area/src/backends/backendsCommon && /usr/bin/c++ -DARMCOMPUTECL_ENABLED -DARMCOMPUTENEON_ENABLED -DARMNN_DYNAMIC_BACKEND_ENABLED -DARMNN_SERIALIZER -DARMNN_SERIALIZER_SCHEMA_PATH=\"/<<PKGBUILDDIR>>/src/armnnSerializer/ArmnnSchema.fbs\" -DARMNN_TF_LITE_PARSER -DDYNAMIC_BACKEND_BUILD_DIR=\"/<<PKGBUILDDIR>>/build-area\" -I/<<PKGBUILDDIR>>/include -I/<<PKGBUILDDIR>>/profiling -I/<<PKGBUILDDIR>>/include/armnn/backends -I/<<PKGBUILDDIR>>/src/armnn -I/<<PKGBUILDDIR>>/src/armnnUtils -I/<<PKGBUILDDIR>>/src/backends -I/<<PKGBUILDDIR>>/src/profiling -I/<<PKGBUILDDIR>>/profiling/common/include -I/<<PKGBUILDDIR>>/profiling/client/include -isystem /<<PKGBUILDDIR>>/third-party -g -O2 -ffile-prefix-map=/<<PKGBUILDDIR>>=. -fstack-protector-strong -fstack-clash-protection -Wformat -Werror=format-security -mbranch-protection=standard -Wdate-time -D_FORTIFY_SOURCE=2 -std=c++17 -Wall -Wextra -Werror -Wold-style-cast -Wno-missing-braces -Wconversion -Wsign-conversion -Wno-psabi -std=gnu++17 -fPIC '-DDYNAMIC_BACKEND_PATHS="/usr/lib/aarch64-linux-gnu/armnn33/"' -MD -MT src/backends/backendsCommon/CMakeFiles/armnnBackendsCommon.dir/ITensorHandleFactory.cpp.o -MF CMakeFiles/armnnBackendsCommon.dir/ITensorHandleFactory.cpp.o.d -o CMakeFiles/armnnBackendsCommon.dir/ITensorHandleFactory.cpp.o -c /<<PKGBUILDDIR>>/src/backends/backendsCommon/ITensorHandleFactory.cpp
[ 3%] Building CXX object src/backends/backendsCommon/CMakeFiles/armnnBackendsCommon.dir/LayerSupportBase.cpp.o
cd /<<PKGBUILDDIR>>/build-area/src/backends/backendsCommon && /usr/bin/c++ -DARMCOMPUTECL_ENABLED -DARMCOMPUTENEON_ENABLED -DARMNN_DYNAMIC_BACKEND_ENABLED -DARMNN_SERIALIZER -DARMNN_SERIALIZER_SCHEMA_PATH=\"/<<PKGBUILDDIR>>/src/armnnSerializer/ArmnnSchema.fbs\" -DARMNN_TF_LITE_PARSER -DDYNAMIC_BACKEND_BUILD_DIR=\"/<<PKGBUILDDIR>>/build-area\" -I/<<PKGBUILDDIR>>/include -I/<<PKGBUILDDIR>>/profiling -I/<<PKGBUILDDIR>>/include/armnn/backends -I/<<PKGBUILDDIR>>/src/armnn -I/<<PKGBUILDDIR>>/src/armnnUtils -I/<<PKGBUILDDIR>>/src/backends -I/<<PKGBUILDDIR>>/src/profiling -I/<<PKGBUILDDIR>>/profiling/common/include -I/<<PKGBUILDDIR>>/profiling/client/include -isystem /<<PKGBUILDDIR>>/third-party -g -O2 -ffile-prefix-map=/<<PKGBUILDDIR>>=. -fstack-protector-strong -fstack-clash-protection -Wformat -Werror=format-security -mbranch-protection=standard -Wdate-time -D_FORTIFY_SOURCE=2 -std=c++17 -Wall -Wextra -Werror -Wold-style-cast -Wno-missing-braces -Wconversion -Wsign-conversion -Wno-psabi -std=gnu++17 -fPIC '-DDYNAMIC_BACKEND_PATHS="/usr/lib/aarch64-linux-gnu/armnn33/"' -MD -MT src/backends/backendsCommon/CMakeFiles/armnnBackendsCommon.dir/LayerSupportBase.cpp.o -MF CMakeFiles/armnnBackendsCommon.dir/LayerSupportBase.cpp.o.d -o CMakeFiles/armnnBackendsCommon.dir/LayerSupportBase.cpp.o -c /<<PKGBUILDDIR>>/src/backends/backendsCommon/LayerSupportBase.cpp
[ 3%] Linking CXX static library libfmt.a
cd /<<PKGBUILDDIR>>/build-area/third-party/fmt && /usr/bin/cmake -P CMakeFiles/fmt.dir/cmake_clean_target.cmake
cd /<<PKGBUILDDIR>>/build-area/third-party/fmt && /usr/bin/cmake -E cmake_link_script CMakeFiles/fmt.dir/link.txt --verbose=1
make[3]: Leaving directory '/<<PKGBUILDDIR>>/build-area'
[ 3%] Built target armnnMemoryOptimizationStrategiesUnitTests
/usr/bin/ar qc libfmt.a CMakeFiles/fmt.dir/src/format.cc.o
/usr/bin/ranlib libfmt.a
make[3]: Leaving directory '/<<PKGBUILDDIR>>/build-area'
[ 3%] Building CXX object src/backends/backendsCommon/CMakeFiles/armnnBackendsCommon.dir/MapWorkload.cpp.o
cd /<<PKGBUILDDIR>>/build-area/src/backends/backendsCommon && /usr/bin/c++ -DARMCOMPUTECL_ENABLED -DARMCOMPUTENEON_ENABLED -DARMNN_DYNAMIC_BACKEND_ENABLED -DARMNN_SERIALIZER -DARMNN_SERIALIZER_SCHEMA_PATH=\"/<<PKGBUILDDIR>>/src/armnnSerializer/ArmnnSchema.fbs\" -DARMNN_TF_LITE_PARSER -DDYNAMIC_BACKEND_BUILD_DIR=\"/<<PKGBUILDDIR>>/build-area\" -I/<<PKGBUILDDIR>>/include -I/<<PKGBUILDDIR>>/profiling -I/<<PKGBUILDDIR>>/include/armnn/backends -I/<<PKGBUILDDIR>>/src/armnn -I/<<PKGBUILDDIR>>/src/armnnUtils -I/<<PKGBUILDDIR>>/src/backends -I/<<PKGBUILDDIR>>/src/profiling -I/<<PKGBUILDDIR>>/profiling/common/include -I/<<PKGBUILDDIR>>/profiling/client/include -isystem /<<PKGBUILDDIR>>/third-party -g -O2 -ffile-prefix-map=/<<PKGBUILDDIR>>=. -fstack-protector-strong -fstack-clash-protection -Wformat -Werror=format-security -mbranch-protection=standard -Wdate-time -D_FORTIFY_SOURCE=2 -std=c++17 -Wall -Wextra -Werror -Wold-style-cast -Wno-missing-braces -Wconversion -Wsign-conversion -Wno-psabi -std=gnu++17 -fPIC '-DDYNAMIC_BACKEND_PATHS="/usr/lib/aarch64-linux-gnu/armnn33/"' -MD -MT src/backends/backendsCommon/CMakeFiles/armnnBackendsCommon.dir/MapWorkload.cpp.o -MF CMakeFiles/armnnBackendsCommon.dir/MapWorkload.cpp.o.d -o CMakeFiles/armnnBackendsCommon.dir/MapWorkload.cpp.o -c /<<PKGBUILDDIR>>/src/backends/backendsCommon/MapWorkload.cpp
[ 3%] Built target fmt
[ 3%] Building CXX object src/backends/backendsCommon/CMakeFiles/armnnBackendsCommon.dir/MemCopyWorkload.cpp.o
cd /<<PKGBUILDDIR>>/build-area/src/backends/backendsCommon && /usr/bin/c++ -DARMCOMPUTECL_ENABLED -DARMCOMPUTENEON_ENABLED -DARMNN_DYNAMIC_BACKEND_ENABLED -DARMNN_SERIALIZER -DARMNN_SERIALIZER_SCHEMA_PATH=\"/<<PKGBUILDDIR>>/src/armnnSerializer/ArmnnSchema.fbs\" -DARMNN_TF_LITE_PARSER -DDYNAMIC_BACKEND_BUILD_DIR=\"/<<PKGBUILDDIR>>/build-area\" -I/<<PKGBUILDDIR>>/include -I/<<PKGBUILDDIR>>/profiling -I/<<PKGBUILDDIR>>/include/armnn/backends -I/<<PKGBUILDDIR>>/src/armnn -I/<<PKGBUILDDIR>>/src/armnnUtils -I/<<PKGBUILDDIR>>/src/backends -I/<<PKGBUILDDIR>>/src/profiling -I/<<PKGBUILDDIR>>/profiling/common/include -I/<<PKGBUILDDIR>>/profiling/client/include -isystem /<<PKGBUILDDIR>>/third-party -g -O2 -ffile-prefix-map=/<<PKGBUILDDIR>>=. -fstack-protector-strong -fstack-clash-protection -Wformat -Werror=format-security -mbranch-protection=standard -Wdate-time -D_FORTIFY_SOURCE=2 -std=c++17 -Wall -Wextra -Werror -Wold-style-cast -Wno-missing-braces -Wconversion -Wsign-conversion -Wno-psabi -std=gnu++17 -fPIC '-DDYNAMIC_BACKEND_PATHS="/usr/lib/aarch64-linux-gnu/armnn33/"' -MD -MT src/backends/backendsCommon/CMakeFiles/armnnBackendsCommon.dir/MemCopyWorkload.cpp.o -MF CMakeFiles/armnnBackendsCommon.dir/MemCopyWorkload.cpp.o.d -o CMakeFiles/armnnBackendsCommon.dir/MemCopyWorkload.cpp.o -c /<<PKGBUILDDIR>>/src/backends/backendsCommon/MemCopyWorkload.cpp
[ 3%] Building CXX object src/backends/backendsCommon/CMakeFiles/armnnBackendsCommon.dir/MemImportWorkload.cpp.o
cd /<<PKGBUILDDIR>>/build-area/src/backends/backendsCommon && /usr/bin/c++ -DARMCOMPUTECL_ENABLED -DARMCOMPUTENEON_ENABLED -DARMNN_DYNAMIC_BACKEND_ENABLED -DARMNN_SERIALIZER -DARMNN_SERIALIZER_SCHEMA_PATH=\"/<<PKGBUILDDIR>>/src/armnnSerializer/ArmnnSchema.fbs\" -DARMNN_TF_LITE_PARSER -DDYNAMIC_BACKEND_BUILD_DIR=\"/<<PKGBUILDDIR>>/build-area\" -I/<<PKGBUILDDIR>>/include -I/<<PKGBUILDDIR>>/profiling -I/<<PKGBUILDDIR>>/include/armnn/backends -I/<<PKGBUILDDIR>>/src/armnn -I/<<PKGBUILDDIR>>/src/armnnUtils -I/<<PKGBUILDDIR>>/src/backends -I/<<PKGBUILDDIR>>/src/profiling -I/<<PKGBUILDDIR>>/profiling/common/include -I/<<PKGBUILDDIR>>/profiling/client/include -isystem /<<PKGBUILDDIR>>/third-party -g -O2 -ffile-prefix-map=/<<PKGBUILDDIR>>=. -fstack-protector-strong -fstack-clash-protection -Wformat -Werror=format-security -mbranch-protection=standard -Wdate-time -D_FORTIFY_SOURCE=2 -std=c++17 -Wall -Wextra -Werror -Wold-style-cast -Wno-missing-braces -Wconversion -Wsign-conversion -Wno-psabi -std=gnu++17 -fPIC '-DDYNAMIC_BACKEND_PATHS="/usr/lib/aarch64-linux-gnu/armnn33/"' -MD -MT src/backends/backendsCommon/CMakeFiles/armnnBackendsCommon.dir/MemImportWorkload.cpp.o -MF CMakeFiles/armnnBackendsCommon.dir/MemImportWorkload.cpp.o.d -o CMakeFiles/armnnBackendsCommon.dir/MemImportWorkload.cpp.o -c /<<PKGBUILDDIR>>/src/backends/backendsCommon/MemImportWorkload.cpp
[ 3%] Building CXX object src/backends/backendsCommon/CMakeFiles/armnnBackendsCommon.dir/MemoryManager.cpp.o
cd /<<PKGBUILDDIR>>/build-area/src/backends/backendsCommon && /usr/bin/c++ -DARMCOMPUTECL_ENABLED -DARMCOMPUTENEON_ENABLED -DARMNN_DYNAMIC_BACKEND_ENABLED -DARMNN_SERIALIZER -DARMNN_SERIALIZER_SCHEMA_PATH=\"/<<PKGBUILDDIR>>/src/armnnSerializer/ArmnnSchema.fbs\" -DARMNN_TF_LITE_PARSER -DDYNAMIC_BACKEND_BUILD_DIR=\"/<<PKGBUILDDIR>>/build-area\" -I/<<PKGBUILDDIR>>/include -I/<<PKGBUILDDIR>>/profiling -I/<<PKGBUILDDIR>>/include/armnn/backends -I/<<PKGBUILDDIR>>/src/armnn -I/<<PKGBUILDDIR>>/src/armnnUtils -I/<<PKGBUILDDIR>>/src/backends -I/<<PKGBUILDDIR>>/src/profiling -I/<<PKGBUILDDIR>>/profiling/common/include -I/<<PKGBUILDDIR>>/profiling/client/include -isystem /<<PKGBUILDDIR>>/third-party -g -O2 -ffile-prefix-map=/<<PKGBUILDDIR>>=. -fstack-protector-strong -fstack-clash-protection -Wformat -Werror=format-security -mbranch-protection=standard -Wdate-time -D_FORTIFY_SOURCE=2 -std=c++17 -Wall -Wextra -Werror -Wold-style-cast -Wno-missing-braces -Wconversion -Wsign-conversion -Wno-psabi -std=gnu++17 -fPIC '-DDYNAMIC_BACKEND_PATHS="/usr/lib/aarch64-linux-gnu/armnn33/"' -MD -MT src/backends/backendsCommon/CMakeFiles/armnnBackendsCommon.dir/MemoryManager.cpp.o -MF CMakeFiles/armnnBackendsCommon.dir/MemoryManager.cpp.o.d -o CMakeFiles/armnnBackendsCommon.dir/MemoryManager.cpp.o -c /<<PKGBUILDDIR>>/src/backends/backendsCommon/MemoryManager.cpp
[ 3%] Building CXX object src/backends/backendsCommon/CMakeFiles/armnnBackendsCommon.dir/MemSyncWorkload.cpp.o
cd /<<PKGBUILDDIR>>/build-area/src/backends/backendsCommon && /usr/bin/c++ -DARMCOMPUTECL_ENABLED -DARMCOMPUTENEON_ENABLED -DARMNN_DYNAMIC_BACKEND_ENABLED -DARMNN_SERIALIZER -DARMNN_SERIALIZER_SCHEMA_PATH=\"/<<PKGBUILDDIR>>/src/armnnSerializer/ArmnnSchema.fbs\" -DARMNN_TF_LITE_PARSER -DDYNAMIC_BACKEND_BUILD_DIR=\"/<<PKGBUILDDIR>>/build-area\" -I/<<PKGBUILDDIR>>/include -I/<<PKGBUILDDIR>>/profiling -I/<<PKGBUILDDIR>>/include/armnn/backends -I/<<PKGBUILDDIR>>/src/armnn -I/<<PKGBUILDDIR>>/src/armnnUtils -I/<<PKGBUILDDIR>>/src/backends -I/<<PKGBUILDDIR>>/src/profiling -I/<<PKGBUILDDIR>>/profiling/common/include -I/<<PKGBUILDDIR>>/profiling/client/include -isystem /<<PKGBUILDDIR>>/third-party -g -O2 -ffile-prefix-map=/<<PKGBUILDDIR>>=. -fstack-protector-strong -fstack-clash-protection -Wformat -Werror=format-security -mbranch-protection=standard -Wdate-time -D_FORTIFY_SOURCE=2 -std=c++17 -Wall -Wextra -Werror -Wold-style-cast -Wno-missing-braces -Wconversion -Wsign-conversion -Wno-psabi -std=gnu++17 -fPIC '-DDYNAMIC_BACKEND_PATHS="/usr/lib/aarch64-linux-gnu/armnn33/"' -MD -MT src/backends/backendsCommon/CMakeFiles/armnnBackendsCommon.dir/MemSyncWorkload.cpp.o -MF CMakeFiles/armnnBackendsCommon.dir/MemSyncWorkload.cpp.o.d -o CMakeFiles/armnnBackendsCommon.dir/MemSyncWorkload.cpp.o -c /<<PKGBUILDDIR>>/src/backends/backendsCommon/MemSyncWorkload.cpp
[ 3%] Building CXX object src/armnnSerializer/CMakeFiles/armnnSerializer-static.dir/SerializerUtils.cpp.o
cd /<<PKGBUILDDIR>>/build-area/src/armnnSerializer && /usr/bin/c++ -DARMCOMPUTECL_ENABLED -DARMCOMPUTENEON_ENABLED -DARMNN_DYNAMIC_BACKEND_ENABLED -DARMNN_SERIALIZER -DARMNN_SERIALIZER_SCHEMA_PATH=\"/<<PKGBUILDDIR>>/src/armnnSerializer/ArmnnSchema.fbs\" -DARMNN_TF_LITE_PARSER -DDYNAMIC_BACKEND_BUILD_DIR=\"/<<PKGBUILDDIR>>/build-area\" -I/<<PKGBUILDDIR>>/include -I/<<PKGBUILDDIR>>/profiling -I/<<PKGBUILDDIR>>/src/armnnSerializer/../armnn -I/<<PKGBUILDDIR>>/src/armnnSerializer/../armnnUtils -I/<<PKGBUILDDIR>>/src/armnnSerializer/../../generated -isystem /<<PKGBUILDDIR>>/third-party -g -O2 -ffile-prefix-map=/<<PKGBUILDDIR>>=. -fstack-protector-strong -fstack-clash-protection -Wformat -Werror=format-security -mbranch-protection=standard -Wdate-time -D_FORTIFY_SOURCE=2 -std=c++17 -Wall -Wextra -Werror -Wold-style-cast -Wno-missing-braces -Wconversion -Wsign-conversion -Wno-psabi -std=gnu++17 -fPIC '-DDYNAMIC_BACKEND_PATHS="/usr/lib/aarch64-linux-gnu/armnn33/"' -MD -MT src/armnnSerializer/CMakeFiles/armnnSerializer-static.dir/SerializerUtils.cpp.o -MF CMakeFiles/armnnSerializer-static.dir/SerializerUtils.cpp.o.d -o CMakeFiles/armnnSerializer-static.dir/SerializerUtils.cpp.o -c /<<PKGBUILDDIR>>/src/armnnSerializer/SerializerUtils.cpp
[ 4%] Building CXX object src/backends/backendsCommon/CMakeFiles/armnnBackendsCommon.dir/OptimizationViews.cpp.o
cd /<<PKGBUILDDIR>>/build-area/src/backends/backendsCommon && /usr/bin/c++ -DARMCOMPUTECL_ENABLED -DARMCOMPUTENEON_ENABLED -DARMNN_DYNAMIC_BACKEND_ENABLED -DARMNN_SERIALIZER -DARMNN_SERIALIZER_SCHEMA_PATH=\"/<<PKGBUILDDIR>>/src/armnnSerializer/ArmnnSchema.fbs\" -DARMNN_TF_LITE_PARSER -DDYNAMIC_BACKEND_BUILD_DIR=\"/<<PKGBUILDDIR>>/build-area\" -I/<<PKGBUILDDIR>>/include -I/<<PKGBUILDDIR>>/profiling -I/<<PKGBUILDDIR>>/include/armnn/backends -I/<<PKGBUILDDIR>>/src/armnn -I/<<PKGBUILDDIR>>/src/armnnUtils -I/<<PKGBUILDDIR>>/src/backends -I/<<PKGBUILDDIR>>/src/profiling -I/<<PKGBUILDDIR>>/profiling/common/include -I/<<PKGBUILDDIR>>/profiling/client/include -isystem /<<PKGBUILDDIR>>/third-party -g -O2 -ffile-prefix-map=/<<PKGBUILDDIR>>=. -fstack-protector-strong -fstack-clash-protection -Wformat -Werror=format-security -mbranch-protection=standard -Wdate-time -D_FORTIFY_SOURCE=2 -std=c++17 -Wall -Wextra -Werror -Wold-style-cast -Wno-missing-braces -Wconversion -Wsign-conversion -Wno-psabi -std=gnu++17 -fPIC '-DDYNAMIC_BACKEND_PATHS="/usr/lib/aarch64-linux-gnu/armnn33/"' -MD -MT src/backends/backendsCommon/CMakeFiles/armnnBackendsCommon.dir/OptimizationViews.cpp.o -MF CMakeFiles/armnnBackendsCommon.dir/OptimizationViews.cpp.o.d -o CMakeFiles/armnnBackendsCommon.dir/OptimizationViews.cpp.o -c /<<PKGBUILDDIR>>/src/backends/backendsCommon/OptimizationViews.cpp
[ 4%] Building CXX object src/backends/backendsCommon/CMakeFiles/armnnBackendsCommon.dir/TensorHandle.cpp.o
cd /<<PKGBUILDDIR>>/build-area/src/backends/backendsCommon && /usr/bin/c++ -DARMCOMPUTECL_ENABLED -DARMCOMPUTENEON_ENABLED -DARMNN_DYNAMIC_BACKEND_ENABLED -DARMNN_SERIALIZER -DARMNN_SERIALIZER_SCHEMA_PATH=\"/<<PKGBUILDDIR>>/src/armnnSerializer/ArmnnSchema.fbs\" -DARMNN_TF_LITE_PARSER -DDYNAMIC_BACKEND_BUILD_DIR=\"/<<PKGBUILDDIR>>/build-area\" -I/<<PKGBUILDDIR>>/include -I/<<PKGBUILDDIR>>/profiling -I/<<PKGBUILDDIR>>/include/armnn/backends -I/<<PKGBUILDDIR>>/src/armnn -I/<<PKGBUILDDIR>>/src/armnnUtils -I/<<PKGBUILDDIR>>/src/backends -I/<<PKGBUILDDIR>>/src/profiling -I/<<PKGBUILDDIR>>/profiling/common/include -I/<<PKGBUILDDIR>>/profiling/client/include -isystem /<<PKGBUILDDIR>>/third-party -g -O2 -ffile-prefix-map=/<<PKGBUILDDIR>>=. -fstack-protector-strong -fstack-clash-protection -Wformat -Werror=format-security -mbranch-protection=standard -Wdate-time -D_FORTIFY_SOURCE=2 -std=c++17 -Wall -Wextra -Werror -Wold-style-cast -Wno-missing-braces -Wconversion -Wsign-conversion -Wno-psabi -std=gnu++17 -fPIC '-DDYNAMIC_BACKEND_PATHS="/usr/lib/aarch64-linux-gnu/armnn33/"' -MD -MT src/backends/backendsCommon/CMakeFiles/armnnBackendsCommon.dir/TensorHandle.cpp.o -MF CMakeFiles/armnnBackendsCommon.dir/TensorHandle.cpp.o.d -o CMakeFiles/armnnBackendsCommon.dir/TensorHandle.cpp.o -c /<<PKGBUILDDIR>>/src/backends/backendsCommon/TensorHandle.cpp
[ 5%] Building CXX object src/armnnSerializer/CMakeFiles/armnnSerializer-static.dir/__/armnnDeserializer/Deserializer.cpp.o
cd /<<PKGBUILDDIR>>/build-area/src/armnnSerializer && /usr/bin/c++ -DARMCOMPUTECL_ENABLED -DARMCOMPUTENEON_ENABLED -DARMNN_DYNAMIC_BACKEND_ENABLED -DARMNN_SERIALIZER -DARMNN_SERIALIZER_SCHEMA_PATH=\"/<<PKGBUILDDIR>>/src/armnnSerializer/ArmnnSchema.fbs\" -DARMNN_TF_LITE_PARSER -DDYNAMIC_BACKEND_BUILD_DIR=\"/<<PKGBUILDDIR>>/build-area\" -I/<<PKGBUILDDIR>>/include -I/<<PKGBUILDDIR>>/profiling -I/<<PKGBUILDDIR>>/src/armnnSerializer/../armnn -I/<<PKGBUILDDIR>>/src/armnnSerializer/../armnnUtils -I/<<PKGBUILDDIR>>/src/armnnSerializer/../../generated -isystem /<<PKGBUILDDIR>>/third-party -g -O2 -ffile-prefix-map=/<<PKGBUILDDIR>>=. -fstack-protector-strong -fstack-clash-protection -Wformat -Werror=format-security -mbranch-protection=standard -Wdate-time -D_FORTIFY_SOURCE=2 -std=c++17 -Wall -Wextra -Werror -Wold-style-cast -Wno-missing-braces -Wconversion -Wsign-conversion -Wno-psabi -std=gnu++17 -fPIC '-DDYNAMIC_BACKEND_PATHS="/usr/lib/aarch64-linux-gnu/armnn33/"' -MD -MT src/armnnSerializer/CMakeFiles/armnnSerializer-static.dir/__/armnnDeserializer/Deserializer.cpp.o -MF CMakeFiles/armnnSerializer-static.dir/__/armnnDeserializer/Deserializer.cpp.o.d -o CMakeFiles/armnnSerializer-static.dir/__/armnnDeserializer/Deserializer.cpp.o -c /<<PKGBUILDDIR>>/src/armnnDeserializer/Deserializer.cpp
[ 5%] Building CXX object src/backends/backendsCommon/CMakeFiles/armnnBackendsCommon.dir/TensorHandleFactoryRegistry.cpp.o
cd /<<PKGBUILDDIR>>/build-area/src/backends/backendsCommon && /usr/bin/c++ -DARMCOMPUTECL_ENABLED -DARMCOMPUTENEON_ENABLED -DARMNN_DYNAMIC_BACKEND_ENABLED -DARMNN_SERIALIZER -DARMNN_SERIALIZER_SCHEMA_PATH=\"/<<PKGBUILDDIR>>/src/armnnSerializer/ArmnnSchema.fbs\" -DARMNN_TF_LITE_PARSER -DDYNAMIC_BACKEND_BUILD_DIR=\"/<<PKGBUILDDIR>>/build-area\" -I/<<PKGBUILDDIR>>/include -I/<<PKGBUILDDIR>>/profiling -I/<<PKGBUILDDIR>>/include/armnn/backends -I/<<PKGBUILDDIR>>/src/armnn -I/<<PKGBUILDDIR>>/src/armnnUtils -I/<<PKGBUILDDIR>>/src/backends -I/<<PKGBUILDDIR>>/src/profiling -I/<<PKGBUILDDIR>>/profiling/common/include -I/<<PKGBUILDDIR>>/profiling/client/include -isystem /<<PKGBUILDDIR>>/third-party -g -O2 -ffile-prefix-map=/<<PKGBUILDDIR>>=. -fstack-protector-strong -fstack-clash-protection -Wformat -Werror=format-security -mbranch-protection=standard -Wdate-time -D_FORTIFY_SOURCE=2 -std=c++17 -Wall -Wextra -Werror -Wold-style-cast -Wno-missing-braces -Wconversion -Wsign-conversion -Wno-psabi -std=gnu++17 -fPIC '-DDYNAMIC_BACKEND_PATHS="/usr/lib/aarch64-linux-gnu/armnn33/"' -MD -MT src/backends/backendsCommon/CMakeFiles/armnnBackendsCommon.dir/TensorHandleFactoryRegistry.cpp.o -MF CMakeFiles/armnnBackendsCommon.dir/TensorHandleFactoryRegistry.cpp.o.d -o CMakeFiles/armnnBackendsCommon.dir/TensorHandleFactoryRegistry.cpp.o -c /<<PKGBUILDDIR>>/src/backends/backendsCommon/TensorHandleFactoryRegistry.cpp
[ 5%] Building CXX object src/backends/backendsCommon/CMakeFiles/armnnBackendsCommon.dir/UnmapWorkload.cpp.o
cd /<<PKGBUILDDIR>>/build-area/src/backends/backendsCommon && /usr/bin/c++ -DARMCOMPUTECL_ENABLED -DARMCOMPUTENEON_ENABLED -DARMNN_DYNAMIC_BACKEND_ENABLED -DARMNN_SERIALIZER -DARMNN_SERIALIZER_SCHEMA_PATH=\"/<<PKGBUILDDIR>>/src/armnnSerializer/ArmnnSchema.fbs\" -DARMNN_TF_LITE_PARSER -DDYNAMIC_BACKEND_BUILD_DIR=\"/<<PKGBUILDDIR>>/build-area\" -I/<<PKGBUILDDIR>>/include -I/<<PKGBUILDDIR>>/profiling -I/<<PKGBUILDDIR>>/include/armnn/backends -I/<<PKGBUILDDIR>>/src/armnn -I/<<PKGBUILDDIR>>/src/armnnUtils -I/<<PKGBUILDDIR>>/src/backends -I/<<PKGBUILDDIR>>/src/profiling -I/<<PKGBUILDDIR>>/profiling/common/include -I/<<PKGBUILDDIR>>/profiling/client/include -isystem /<<PKGBUILDDIR>>/third-party -g -O2 -ffile-prefix-map=/<<PKGBUILDDIR>>=. -fstack-protector-strong -fstack-clash-protection -Wformat -Werror=format-security -mbranch-protection=standard -Wdate-time -D_FORTIFY_SOURCE=2 -std=c++17 -Wall -Wextra -Werror -Wold-style-cast -Wno-missing-braces -Wconversion -Wsign-conversion -Wno-psabi -std=gnu++17 -fPIC '-DDYNAMIC_BACKEND_PATHS="/usr/lib/aarch64-linux-gnu/armnn33/"' -MD -MT src/backends/backendsCommon/CMakeFiles/armnnBackendsCommon.dir/UnmapWorkload.cpp.o -MF CMakeFiles/armnnBackendsCommon.dir/UnmapWorkload.cpp.o.d -o CMakeFiles/armnnBackendsCommon.dir/UnmapWorkload.cpp.o -c /<<PKGBUILDDIR>>/src/backends/backendsCommon/UnmapWorkload.cpp
[ 5%] Building CXX object src/backends/backendsCommon/CMakeFiles/armnnBackendsCommon.dir/WorkloadData.cpp.o
cd /<<PKGBUILDDIR>>/build-area/src/backends/backendsCommon && /usr/bin/c++ -DARMCOMPUTECL_ENABLED -DARMCOMPUTENEON_ENABLED -DARMNN_DYNAMIC_BACKEND_ENABLED -DARMNN_SERIALIZER -DARMNN_SERIALIZER_SCHEMA_PATH=\"/<<PKGBUILDDIR>>/src/armnnSerializer/ArmnnSchema.fbs\" -DARMNN_TF_LITE_PARSER -DDYNAMIC_BACKEND_BUILD_DIR=\"/<<PKGBUILDDIR>>/build-area\" -I/<<PKGBUILDDIR>>/include -I/<<PKGBUILDDIR>>/profiling -I/<<PKGBUILDDIR>>/include/armnn/backends -I/<<PKGBUILDDIR>>/src/armnn -I/<<PKGBUILDDIR>>/src/armnnUtils -I/<<PKGBUILDDIR>>/src/backends -I/<<PKGBUILDDIR>>/src/profiling -I/<<PKGBUILDDIR>>/profiling/common/include -I/<<PKGBUILDDIR>>/profiling/client/include -isystem /<<PKGBUILDDIR>>/third-party -g -O2 -ffile-prefix-map=/<<PKGBUILDDIR>>=. -fstack-protector-strong -fstack-clash-protection -Wformat -Werror=format-security -mbranch-protection=standard -Wdate-time -D_FORTIFY_SOURCE=2 -std=c++17 -Wall -Wextra -Werror -Wold-style-cast -Wno-missing-braces -Wconversion -Wsign-conversion -Wno-psabi -std=gnu++17 -fPIC '-DDYNAMIC_BACKEND_PATHS="/usr/lib/aarch64-linux-gnu/armnn33/"' -MD -MT src/backends/backendsCommon/CMakeFiles/armnnBackendsCommon.dir/WorkloadData.cpp.o -MF CMakeFiles/armnnBackendsCommon.dir/WorkloadData.cpp.o.d -o CMakeFiles/armnnBackendsCommon.dir/WorkloadData.cpp.o -c /<<PKGBUILDDIR>>/src/backends/backendsCommon/WorkloadData.cpp
[ 5%] Building CXX object src/backends/backendsCommon/CMakeFiles/armnnBackendsCommon.dir/WorkloadFactory.cpp.o
cd /<<PKGBUILDDIR>>/build-area/src/backends/backendsCommon && /usr/bin/c++ -DARMCOMPUTECL_ENABLED -DARMCOMPUTENEON_ENABLED -DARMNN_DYNAMIC_BACKEND_ENABLED -DARMNN_SERIALIZER -DARMNN_SERIALIZER_SCHEMA_PATH=\"/<<PKGBUILDDIR>>/src/armnnSerializer/ArmnnSchema.fbs\" -DARMNN_TF_LITE_PARSER -DDYNAMIC_BACKEND_BUILD_DIR=\"/<<PKGBUILDDIR>>/build-area\" -I/<<PKGBUILDDIR>>/include -I/<<PKGBUILDDIR>>/profiling -I/<<PKGBUILDDIR>>/include/armnn/backends -I/<<PKGBUILDDIR>>/src/armnn -I/<<PKGBUILDDIR>>/src/armnnUtils -I/<<PKGBUILDDIR>>/src/backends -I/<<PKGBUILDDIR>>/src/profiling -I/<<PKGBUILDDIR>>/profiling/common/include -I/<<PKGBUILDDIR>>/profiling/client/include -isystem /<<PKGBUILDDIR>>/third-party -g -O2 -ffile-prefix-map=/<<PKGBUILDDIR>>=. -fstack-protector-strong -fstack-clash-protection -Wformat -Werror=format-security -mbranch-protection=standard -Wdate-time -D_FORTIFY_SOURCE=2 -std=c++17 -Wall -Wextra -Werror -Wold-style-cast -Wno-missing-braces -Wconversion -Wsign-conversion -Wno-psabi -std=gnu++17 -fPIC '-DDYNAMIC_BACKEND_PATHS="/usr/lib/aarch64-linux-gnu/armnn33/"' -MD -MT src/backends/backendsCommon/CMakeFiles/armnnBackendsCommon.dir/WorkloadFactory.cpp.o -MF CMakeFiles/armnnBackendsCommon.dir/WorkloadFactory.cpp.o.d -o CMakeFiles/armnnBackendsCommon.dir/WorkloadFactory.cpp.o -c /<<PKGBUILDDIR>>/src/backends/backendsCommon/WorkloadFactory.cpp
[ 6%] Building CXX object src/backends/backendsCommon/CMakeFiles/armnnBackendsCommon.dir/WorkloadUtils.cpp.o
cd /<<PKGBUILDDIR>>/build-area/src/backends/backendsCommon && /usr/bin/c++ -DARMCOMPUTECL_ENABLED -DARMCOMPUTENEON_ENABLED -DARMNN_DYNAMIC_BACKEND_ENABLED -DARMNN_SERIALIZER -DARMNN_SERIALIZER_SCHEMA_PATH=\"/<<PKGBUILDDIR>>/src/armnnSerializer/ArmnnSchema.fbs\" -DARMNN_TF_LITE_PARSER -DDYNAMIC_BACKEND_BUILD_DIR=\"/<<PKGBUILDDIR>>/build-area\" -I/<<PKGBUILDDIR>>/include -I/<<PKGBUILDDIR>>/profiling -I/<<PKGBUILDDIR>>/include/armnn/backends -I/<<PKGBUILDDIR>>/src/armnn -I/<<PKGBUILDDIR>>/src/armnnUtils -I/<<PKGBUILDDIR>>/src/backends -I/<<PKGBUILDDIR>>/src/profiling -I/<<PKGBUILDDIR>>/profiling/common/include -I/<<PKGBUILDDIR>>/profiling/client/include -isystem /<<PKGBUILDDIR>>/third-party -g -O2 -ffile-prefix-map=/<<PKGBUILDDIR>>=. -fstack-protector-strong -fstack-clash-protection -Wformat -Werror=format-security -mbranch-protection=standard -Wdate-time -D_FORTIFY_SOURCE=2 -std=c++17 -Wall -Wextra -Werror -Wold-style-cast -Wno-missing-braces -Wconversion -Wsign-conversion -Wno-psabi -std=gnu++17 -fPIC '-DDYNAMIC_BACKEND_PATHS="/usr/lib/aarch64-linux-gnu/armnn33/"' -MD -MT src/backends/backendsCommon/CMakeFiles/armnnBackendsCommon.dir/WorkloadUtils.cpp.o -MF CMakeFiles/armnnBackendsCommon.dir/WorkloadUtils.cpp.o.d -o CMakeFiles/armnnBackendsCommon.dir/WorkloadUtils.cpp.o -c /<<PKGBUILDDIR>>/src/backends/backendsCommon/WorkloadUtils.cpp
[ 6%] Building CXX object tests/CMakeFiles/inferenceTest.dir/InferenceTestImage.cpp.o
cd /<<PKGBUILDDIR>>/build-area/tests && /usr/bin/c++ -DARMCOMPUTECL_ENABLED -DARMCOMPUTENEON_ENABLED -DARMNN_DYNAMIC_BACKEND_ENABLED -DARMNN_SERIALIZER -DARMNN_SERIALIZER_SCHEMA_PATH=\"/<<PKGBUILDDIR>>/src/armnnSerializer/ArmnnSchema.fbs\" -DARMNN_TF_LITE_PARSER -DDYNAMIC_BACKEND_BUILD_DIR=\"/<<PKGBUILDDIR>>/build-area\" -I/<<PKGBUILDDIR>>/include -I/<<PKGBUILDDIR>>/profiling -I/<<PKGBUILDDIR>>/tests/../src/armnnUtils -I/<<PKGBUILDDIR>>/tests/../src/backends -I/<<PKGBUILDDIR>>/tests/../third-party/stb -isystem /<<PKGBUILDDIR>>/third-party -g -O2 -ffile-prefix-map=/<<PKGBUILDDIR>>=. -fstack-protector-strong -fstack-clash-protection -Wformat -Werror=format-security -mbranch-protection=standard -Wdate-time -D_FORTIFY_SOURCE=2 -std=c++17 -Wall -Wextra -Werror -Wold-style-cast -Wno-missing-braces -Wconversion -Wsign-conversion -Wno-psabi -std=gnu++17 -fPIC '-DDYNAMIC_BACKEND_PATHS="/usr/lib/aarch64-linux-gnu/armnn33/"' -MD -MT tests/CMakeFiles/inferenceTest.dir/InferenceTestImage.cpp.o -MF CMakeFiles/inferenceTest.dir/InferenceTestImage.cpp.o.d -o CMakeFiles/inferenceTest.dir/InferenceTestImage.cpp.o -c /<<PKGBUILDDIR>>/tests/InferenceTestImage.cpp
[ 6%] Linking CXX static library libinferenceTest.a
cd /<<PKGBUILDDIR>>/build-area/tests && /usr/bin/cmake -P CMakeFiles/inferenceTest.dir/cmake_clean_target.cmake
cd /<<PKGBUILDDIR>>/build-area/tests && /usr/bin/cmake -E cmake_link_script CMakeFiles/inferenceTest.dir/link.txt --verbose=1
/usr/bin/ar qc libinferenceTest.a CMakeFiles/inferenceTest.dir/InferenceTest.cpp.o CMakeFiles/inferenceTest.dir/InferenceTestImage.cpp.o
/usr/bin/ranlib libinferenceTest.a
make[3]: Leaving directory '/<<PKGBUILDDIR>>/build-area'
[ 6%] Built target inferenceTest
make[3]: Leaving directory '/<<PKGBUILDDIR>>/build-area'
[ 6%] Built target armnnBackendsCommon
[ 6%] Linking CXX static library ../../libarmnnSerializer-static.a
cd /<<PKGBUILDDIR>>/build-area/src/armnnSerializer && /usr/bin/cmake -P CMakeFiles/armnnSerializer-static.dir/cmake_clean_target.cmake
cd /<<PKGBUILDDIR>>/build-area/src/armnnSerializer && /usr/bin/cmake -E cmake_link_script CMakeFiles/armnnSerializer-static.dir/link.txt --verbose=1
/usr/bin/ar qc ../../libarmnnSerializer-static.a "CMakeFiles/armnnSerializer-static.dir/Serializer.cpp.o" "CMakeFiles/armnnSerializer-static.dir/SerializerUtils.cpp.o" "CMakeFiles/armnnSerializer-static.dir/__/armnnDeserializer/Deserializer.cpp.o"
/usr/bin/ranlib ../../libarmnnSerializer-static.a
make[3]: Leaving directory '/<<PKGBUILDDIR>>/build-area'
[ 6%] Built target armnnSerializer-static
make[2]: Leaving directory '/<<PKGBUILDDIR>>/build-area'
make[1]: *** [Makefile:139: all] Error 2
make[1]: Leaving directory '/<<PKGBUILDDIR>>/build-area'
dh_auto_build: error: cd build-area && make -j8 "INSTALL=install --strip-program=true" VERBOSE=1 returned exit code 2
make: *** [debian/rules:35: binary] Error 25
dpkg-buildpackage: error: debian/rules binary subprocess returned exit status 2
--------------------------------------------------------------------------------
Build finished at 2024-11-15T19:13:11Z
Finished
--------
+------------------------------------------------------------------------------+
| Cleanup |
+------------------------------------------------------------------------------+
Purging /<<BUILDDIR>>
Not cleaning session: cloned chroot in use
E: Build failure (dpkg-buildpackage died)
+------------------------------------------------------------------------------+
| Summary |
+------------------------------------------------------------------------------+
Build Architecture: arm64
Build Type: binary
Build-Space: 149536
Build-Time: 26
Distribution: sid
Fail-Stage: build
Host Architecture: arm64
Install-Time: 44
Job: /tmp/debusine-fetch-exec-upload-vfdej8m0/armnn_23.08-4.1.dsc
Machine Architecture: arm64
Package: armnn
Package-Time: 107
Source-Version: 23.08-4.1
Space: 149536
Status: attempted
Version: 23.08-4.1
--------------------------------------------------------------------------------
Finished at 2024-11-15T19:13:11Z
Build needed 00:01:47, 149536k disk space